{"text_format":"1","workbook":"xlsx","n_sheets":11,"sheets":["About","Intro","Definitions","Glazing","Solar prot device","Solar prot device - data","Results-1","Results-2","Results-3","Update","GA_cookies"],"not_rendered":{"charts":1,"images":6,"macros":1,"external_links":0,"defined_names":15,"comments":2,"pivot_tables":0},"unopened":[],"bounds":{"document_bytes":16777216,"sheet_cells":100000,"rows_first":2000,"rows_last":500,"rows_between":2000,"halvings":0,"cell_chars":16384,"cell_head_chars":4096},"cells_cut":0,"cells_raw":0,"read":"whole","date_system":"1900"}

{"sheet":"About","index":0,"n_rows":29,"n_cols":5,"rows_kept":29,"cut":false,"hidden":false,"merged":[[25,1,26,7]]}
[]
[]
[null,null,null,null,"EN 52022-1:2007"]
[]
[null,null,null,null,"Solar protection devices combined with glazing -"]
[null,null,null,null,"Calculation of solar and light transmittance -"]
[null,null,null,null,"Part 1: Simplified method"]
[]
[null,null,null,null,"Ontwikkeld door /  Développé par"]
[]
[]
[]
[]
[]
[]
[]
[]
[]
[]
[null,null,null,null,"in het kader van de Normen-Antenne"]
[null,null,null,null,"\"Thermische Isolatie en Installaties in Gebouwen\""]
[]
[null,null,null,null,"dans le cadre de l'Antenne-Normes"]
[null,null,null,null,"\"Isolation et Installations Thermiques du Bâtiment\""]
[]
[null,"Read our discaimer on www.buildwise.be"]
[]
[]
[null,null,null,null,"Version 8.1"]

{"sheet":"Intro","index":1,"n_rows":16,"n_cols":3,"rows_kept":16,"cut":false,"hidden":false,"merged":[]}
[]
[null,"EUROPEAN STANDARD EN ISO 52022-1:2017"]
[null,"Solar protection devices combined with glazing - Calculation of solar and light transmittance - Part 1 : Simplified method"]
[null,"The standard EN ISO 52022-1 gives a simplified method based on the usually known data of the glazing, the U- and g-value, and the solar transmittance and reflectance of the solar protection device to estimate the total solar energy transmittance of a solar protection device combined with a glazing."]
[null,"\nThe results of this simplified method are approximate and generally tend to lie on the safe side for cooling load estimations."]
[null,"\nThe text of the standard EN ISO 52022-1 must be consulted to know the exact application of this method. When the simplified method is not applicable, the detailled method described in EN ISO 52022-3 must be applied. "]
[null,"\nThis Excel sheet allows to carry out the calculations given in this standard in order to be able to estimate the total solar energy transmittance (g-value), the direct solar transmittance, the secondary internal heat transfer factor and the light transmittance of a solar protection device combined with glazing."]
[null,"\nIt contains the following sheets:"]
[null,"· Some definitions are given in the sheet \"Definitions\".","Definitions"]
[null,"· Typical data for glazing are indicated in the sheet \"Glazing\".","Glazing"]
[null,"· Typical data for solar protection devices are indicated in the sheet \"Solar prot device\".","Solar prot device"]
[null,"· Data for solar protection devices have to be entered in the sheet \"Solar prot device - Data\".","Solar prot device - data"]
[null,"· The worksheet \"Results-1\" gives the calculation of the total solar energy transmittance, the direct solar transmittance, the secondary internal heat transfer factor and the light transmittance of the specified solar protection devices combined with one specified glazing.","Results-1"]
[null,"· The worksheet \"Results-2\" allows to see the effect of the g- and U-values of the glazing on the total solar energy transmittance of the combination solar protection device - glazing.","Results-2"]
[null,"· The worksheet \"Results-3\" gives the calculation of the total solar energy transmittance (g-value), the direct solar transmittance and the secondary internal heat transfer factor of the combination of the specified solar protection devices with the 5 reference glazing defined in the standard EN 14501:2021.","Results-3"]
[null,"· The worksheet \"Update\" gives an explanation of the update of this version of the Excel tool compared to the previous one. ","Update"]

{"sheet":"Definitions","index":2,"n_rows":52,"n_cols":3,"rows_kept":52,"cut":false,"hidden":false,"merged":[[10,1,10,2],[35,1,35,2],[46,1,46,2]]}
[]
[null,"Definitions"]
[null,"τe ","The direct solar transmittance is the fraction of the incident solar radiation that is directly transmitted by the component (component can be : glazing, solar protection device, combination solar protection device-glazing, …)"]
[null,"ρe","The direct solar reflectance is the fraction of the incident solar radiation that is directly reflected by the component."]
[null,"g","The total solar energy transmittance (solar factor) is the sum of the direct solar transmittance te and the indirect solar transmittance (fraction of the absorbed radiation that is reemitted to inside).This is the fraction of the total transmitted energy to the total incident solar radiation."]
[null,"U","The thermal transmittance is the density of heat flow rate through a component in the steady state divided by the temperature difference between the surroundings on each side of the component (in W/m² K)"]
[null,"Fc ","The Shading factor is the ratio of the solar factor of the combined glazing and solar protection device gtot to that of the glazing alone g "]
[]
[null,"Characteristic data"]
[null,"Glazing"]
[null,"The glazing is characterised by its thermal transmittance Ug, its total solar energy transmittance g and its transmittance and reflectance values. "]
[null,"Ug ","Thermal transmittance of the glazing [W/m²K]"]
[null,"g","Total solar energy transmittance [-]"]
[null,"τe","Direct solar transmittance of the glazing [-]"]
[null,"ρe","Solar reflectance of the glazing (side facing the incident radiation) [-]"]
[null,"ρ'e","Solar reflectance of the glazing (opposite side from incident radiation) [-]"]
[null,"τv ","Light transmittance of the glazing [-]"]
[null,"ρv ","Light reflectance of the glazing (side facing the incident radiation) [-]"]
[null,"ρ'v ","Light reflectance of the glazing (opposite side from incident radiation) [-]"]
[null,"qi ","Secondary internal heat transfer factor [-] (qi=g - te)"]
[]
[]
[]
[]
[]
[]
[]
[]
[]
[]
[]
[]
[]
[]
[null,"Solar protection device"]
[null,"Solar protection devices are characterised by the following factors :"]
[null,"τe,B ","(Direct) Solar transmittance of the solar protection device [-]"]
[null,"ρe,B ","Solar reflectance of the side of the solar protection device facing the incident radiation [-]"]
[null,"ρ'e,B ","Solar reflectance of the side of the solar protection device opposite from the incident radiation [-]"]
[null,"αe,B","Solar absorptance of the side of the solar protection device facing the incident radiation [-]"]
[null,"τv,B ","Light transmittance of the solar protection device [-]"]
[null,"ρv,B ","Light reflectance of the side of the solar protection device facing the incident radiation [-]"]
[null,"ρ'v,B ","Light reflectance of the side of the solar protection device opposite from the incident radiation [-]"]
[]
[]
[]
[]
[null,"g tot ","Total solar energy transmittance [-]"]
[null,"τe,tot ","Direct solar transmittance [-]"]
[null,"qi,tot","Secondary internal heat transfer factor [-] (qi,tot=g,tot - te,tot)"]
[null,"τv,tot ","Light transmittance [-]"]
[null,"Fc ","Shading factor [-]"]

{"sheet":"Glazing","index":3,"n_rows":14,"n_cols":11,"rows_kept":14,"cut":false,"hidden":false,"merged":[[13,1,13,10]]}
[]
[null,"Data for typical glazing"]
[null,"As defined in Annex A of EN 14501:2021"]
[]
[null,"Reference","Product","Ug\nW/(m².K)","g","τe","ρe","ρ'e","τv","ρv","ρ'v"]
[null,"Glazing A","Clear single glazing (4 mm)",5.8,0.85,0.83,0.08,0.08,0.9,0.08,0.08]
[null,"Glazing B","Clear double glazing (4-12-4)",2.9,0.76,0.69,0.14000000000000001,0.14000000000000001,0.82,0.15,0.15]
[null,"Glazing C","Double glazing (4-16-4)",1.2,0.59,0.49,0.28999999999999998,0.27,0.8,0.15,0.1]
[null,"Glazing D","Solar control glazing (4-16-4)",1.1000000000000001,0.32,0.27,0.28999999999999998,0.38,0.44,0.43,0.38]
[null,"Glazing E","Triple glazing (4-14-4-14-4)",0.8,0.55000000000000004,0.5,0.22,0.23,0.73,0.16,0.16]
[]
[null,"According to EN 14501, for product comparison glazing C shall be used."]
[null,"\nEN 14501 also defines reference glazing F, G and H. Those glazing must be used when the detailled method of EN ISO 52022-3 is used.\n"]
[null,"The real data (U-value, g-value, light and solar transmittance and reflectance) for the glazing with which you want to combine the solar protection devices have to be introduced in the worsheet \"Results-1\"."]

{"sheet":"Solar prot device","index":4,"n_rows":14,"n_cols":7,"rows_kept":14,"cut":false,"hidden":false,"merged":[[4,1,4,6],[15,1,15,6],[14,1,14,6],[6,3,6,6],[6,2,7,2]]}
[]
[null,"Typical data for solar protection devices"]
[null,"As defined in Annex E of ISO/TR 52022-2:2017"]
[]
[null,"The next table gives typical values of transmittance and reflectance of solar protection device materials. These are indicative values given for information."]
[]
[null,null,"τe,B","ρe,B"]
[null,null,null,"White","Pastel","Dark","Black"]
[null,"Opaque (e.g. closed roller shutter)",0,0.7,0.5,0.3,0.1]
[null,"Closed venetian blind with opque slats",0.1,0.7,0.5,0.3,0.1]
[null,"Medium translucent",0.2,0.6,0.4,0.2,0.1]
[null,"High translucent",0.4,0.4,0.3,0.2,0.1]
[]
[null,"The absorptance, αe,B, is equal to 1 - τe,B - ρe,B."]

{"sheet":"Solar prot device - data","index":5,"n_rows":114,"n_cols":10,"rows_kept":114,"cut":false,"hidden":false,"merged":[[8,2,8,8],[6,2,6,8],[7,2,7,8]]}
[]
[null,"Data for solar protection device"]
[]
[null,"Please enter the characteristic data of your solar protection devices in the following table :"]
[null,"Where:"]
[null,"τe,B *","(Direct) Solar transmittance of the solar protection device [-]",null,null,null,null,null,null,"* Required for the calculation of the g-value"]
[null,"ρe,B * ","Solar reflectance of the side of the solar protection device facing the incident radiation [-]",null,null,null,null,null,null,"* Required for the calculation of the g-value"]
[null,"ρ'e,B ","Solar reflectance of the side of the solar protection device opposite from the incident radiation [-]"]
[null,"αe,B","Solar absorptance of the side of the solar protection device facing the incident radiation [-]"]
[null,"τv,B ","Light transmittance of the solar protection device [-]"]
[null,"ρv,B ","Light reflectance of the side of the solar protection device facing the incident radiation [-]"]
[null,"ρ'v,B ","Light reflectance of the side of the solar protection device opposite from the incident radiation [-]"]
[]
[null,"Prot. Nr","Name of the solar protection device","τe,B","ρe,B","ρ'e,B","αe,B","τv,B","ρv,B","ρ'v,B"]
[null,1,"Opaque - White",0,0.7,0.7,{"$f":"IF(OR(D15=\"\",E15=\"\"),\"\",1-D15-E15)","v":0.30000000000000004},0,0.7,0.7]
[null,2,"Opaque - Pastel",0,0.5,0.5,{"$f":"IF(OR(D16=\"\",E16=\"\"),\"\",1-D16-E16)","v":0.5},0,0.5,0.5]
[null,3,"Opaque - Dark",0,0.3,0.3,0.7,0,0.3,0.3]
[null,4,"Opaque - Black",0,0.1,0.1,0.9,0,0.1,0.1]
[null,5,"Medium translucent - White",0.2,0.6,0.6,0.20000000000000007,0.2,0.6,0.6]
[null,6,"Medium translucent - Pastel",0.2,0.4,0.4,0.4,0.2,0.4,0.4]
[null,7,"Medium translucent - Dark",0.2,0.2,0.2,0.60000000000000009,0.2,0.2,0.2]
[null,8,"Medium translucent - Black",0.2,0.1,0.1,0.70000000000000007,0.2,0.1,0.1]
[null,9,"High translucent - White",0.4,0.4,0.4,0.19999999999999996,0.4,0.4,0.4]
[null,10,"High translucent - Pastel",0.4,0.3,0.3,0.3,0.4,0.3,0.3]
[null,11,"High translucent - Dark",0.4,0.2,0.2,0.39999999999999997,0.4,0.2,0.2]
[null,12,"High translucent - Black",0.4,0.1,0.1,0.5,0.4,0.1,0.1]
[null,13,null,null,null,null,""]
[null,14,null,null,null,null,""]
[null,15,null,null,null,null,""]
[null,16,null,null,null,null,""]
[null,17,null,null,null,null,""]
[null,18,null,null,null,null,""]
[null,19,null,null,null,null,{"$f":"IF(OR(D33=\"\",E33=\"\"),\"\",1-D33-E33)","v":""}]
[null,20,null,null,null,null,{"$f":"IF(OR(D34=\"\",E34=\"\"),\"\",1-D34-E34)","v":""}]
[null,21,null,null,null,null,{"$f":"IF(OR(D35=\"\",E35=\"\"),\"\",1-D35-E35)","v":""}]
[null,22,null,null,null,null,{"$f":"IF(OR(D36=\"\",E36=\"\"),\"\",1-D36-E36)","v":""}]
[null,23,null,null,null,null,{"$f":"IF(OR(D37=\"\",E37=\"\"),\"\",1-D37-E37)","v":""}]
[null,24,null,null,null,null,""]
[null,25,null,null,null,null,""]
[null,26,null,null,null,null,""]
[null,27,null,null,null,null,""]
[null,28,null,null,null,null,""]
[null,29,null,null,null,null,""]
[null,30,null,null,null,null,""]
[null,31,null,null,null,null,""]
[null,32,null,null,null,null,""]
[null,33,null,null,null,null,""]
[null,34,null,null,null,null,""]
[null,35,null,null,null,null,{"$f":"IF(OR(D49=\"\",E49=\"\"),\"\",1-D49-E49)","v":""}]
[null,36,null,null,null,null,""]
[null,37,null,null,null,null,""]
[null,38,null,null,null,null,""]
[null,39,null,null,null,null,""]
[null,40,null,null,null,null,""]
[null,41,null,null,null,null,""]
[null,42,null,null,null,null,""]
[null,43,null,null,null,null,""]
[null,44,null,null,null,null,""]
[null,45,null,null,null,null,""]
[null,46,null,null,null,null,""]
[null,47,null,null,null,null,""]
[null,48,null,null,null,null,""]
[null,49,null,null,null,null,""]
[null,50,null,null,null,null,""]
[null,51,null,null,null,null,""]
[null,52,null,null,null,null,""]
[null,53,null,null,null,null,""]
[null,54,null,null,null,null,""]
[null,55,null,null,null,null,""]
[null,56,null,null,null,null,""]
[null,57,null,null,null,null,""]
[null,58,null,null,null,null,""]
[null,59,null,null,null,null,""]
[null,60,null,null,null,null,""]
[null,61,null,null,null,null,""]
[null,62,null,null,null,null,""]
[null,63,null,null,null,null,""]
[null,64,null,null,null,null,""]
[null,65,null,null,null,null,""]
[null,66,null,null,null,null,""]
[null,67,null,null,null,null,""]
[null,68,null,null,null,null,""]
[null,69,null,null,null,null,""]
[null,70,null,null,null,null,""]
[null,71,null,null,null,null,""]
[null,72,null,null,null,null,""]
[null,73,null,null,null,null,""]
[null,74,null,null,null,null,""]
[null,75,null,null,null,null,""]
[null,76,null,null,null,null,""]
[null,77,null,null,null,null,""]
[null,78,null,null,null,null,""]
[null,79,null,null,null,null,""]
[null,80,null,null,null,null,""]
[null,81,null,null,null,null,""]
[null,82,null,null,null,null,""]
[null,83,null,null,null,null,""]
[null,84,null,null,null,null,""]
[null,85,null,null,null,null,""]
[null,86,null,null,null,null,""]
[null,87,null,null,null,null,""]
[null,88,null,null,null,null,""]
[null,89,null,null,null,null,""]
[null,90,null,null,null,null,""]
[null,91,null,null,null,null,""]
[null,92,null,null,null,null,""]
[null,93,null,null,null,null,""]
[null,94,null,null,null,null,""]
[null,95,null,null,null,null,""]
[null,96,null,null,null,null,""]
[null,97,null,null,null,null,""]
[null,98,null,null,null,null,""]
[null,99,null,null,null,null,{"$f":"IF(OR(D113=\"\",E113=\"\"),\"\",1-D113-E113)","v":""}]
[null,100,null,null,null,null,{"$f":"IF(OR(D114=\"\",E114=\"\"),\"\",1-D114-E114)","v":""}]

{"sheet":"Results-1","index":6,"n_rows":114,"n_cols":28,"rows_kept":114,"cut":false,"hidden":false,"merged":[[7,1,7,18],[12,10,12,12],[12,20,12,22],[12,13,12,14],[12,15,12,16],[12,17,12,18]]}
[]
[null,"Please enter the characteristic data of the glazing with which you want to combine the solar protection device :",null,null,null,null,null,null,null,null,null,null,null,null,null,null,null,null,null,null,null,null,null,null,null,null,"G1",5]
[null,"* Required for the calculation of the g-value",null,null,null,null,null,null,null,null,null,null,null,null,null,null,null,null,null,null,null,null,null,null,null,null,"G2 ext",10]
[null,null,null,null,null,null,null,null,null,null,null,null,null,null,null,null,null,null,null,null,null,null,null,null,null,null,"G2 int",30]
[null,null,"Name of the glazing","Ug * ","g * ","τe ","ρe ","ρ'e ","τv ","ρv ","ρ'v ",null,null,null,null,null,null,null,null,null,null,null,null,null,null,null,"G3",3]
[null,null,"Your glazing",1.2,0.59,0.49,0.23,0.28999999999999998,0.8,0.15,0.1,null,null,null,null,null,null,null,null,null,null,null,null,null,null,null,"G ext",{"$f":"1/(1/$D$6+1/$AB$2+1/$AB$3)","v":0.88235294117647045}]
[null,null,null,null,null,null,null,null,null,null,null,null,null,null,null,null,null,null,null,null,null,null,null,null,null,null,"G int",{"$f":"1/(1/$D$6+1/$AB$4)","v":1.1538461538461537}]
[null,"The following table gives the total solar energy transmittance gtot, the direct solar transmittance τe,tot, the secondary internal heat transfer factor qi,tot and the light transmittance τv,tot for the combination of the specified glazing (see characteristics above) and solar protection devices (see characteristics in sheet \"Solar prot. device-data\") according to the standard EN ISO 52022-1. Three cases are distinguished : external solar protection device, internal solar protection device and integrated solar protection device (between glass panes). The calculations are done for the 3 cases, independently of the intended use of the protection device.",null,null,null,null,null,null,null,null,null,null,null,null,null,null,null,null,null,null,null,null,null,null,null,null,"G between",{"$f":"1/(1/$D$6+1/$AB$5)","v":0.8571428571428571}]
[]
[]
[]
[]
[null,null,null,null,null,null,null,null,null,null,"gtot ",null,null,"τe, tot",null,"qi,tot ",null,"τv, tot ",null,null,"Fc  "]
[null,"Comb. Nr","Name of the combination glazing + blind","τe,B","ρe,B","ρ'e,B ","αe,B","τv,B ","ρv,B ","ρ'v,B","External prot. dev.","Internal prot. dev.","Integrated prot. dev.","External prot. dev.","Internal prot. dev.","External prot. dev.","Internal prot. dev.","External prot. dev.","Internal prot. dev.",null,"External prot. dev.","Internal prot. dev.","Integrated prot. dev."]
[null,{"$f":"'Solar prot device - data'!B15","v":1},{"$f":"IF('Solar prot device - data'!C15<>\"\",C$6&\" + \"&'Solar prot device - data'!C15,\"\")","v":"Your glazing + Opaque - White"},{"$f":"IF('Solar prot device - data'!D15<>\"\",'Solar prot device - data'!D15,\"\")","v":0},{"$f":"IF('Solar prot device - data'!E15<>\"\",'Solar prot device - data'!E15,\"\")","v":0.7},{"$f":"IF('Solar prot device - data'!F15<>\"\",'Solar prot device - data'!F15,\"\")","v":0.7},{"$f":"IF('Solar prot device - data'!G15<>\"\",'Solar prot device - data'!G15,\"\")","v":0.30000000000000004},{"$f":"IF('Solar prot device - data'!H15<>\"\",'Solar prot device - data'!H15,\"\")","v":0},{"$f":"IF('Solar prot device - data'!I15<>\"\",'Solar prot device - data'!I15,\"\")","v":0.7},{"$f":"IF('Solar prot device - data'!J15<>\"\",'Solar prot device - data'!J15,\"\")","v":0.7},{"$f":"IF(AND(D15<>\"\",E15<>\"\",$D$6<>\"\",$E$6<>\"\"),D15*$E$6+G15*$AB$6/$AB$3+D15*(1-$E$6)*$AB$6/$AB$2,\"\")","v":2.6470588235294117E-2},{"$f":"IF(AND(D15<>\"\",E15<>\"\",$D$6<>\"\",$E$6<>\"\"),$E$6*(1-$E$6*E15-G15*$AB$7/$AB$4),\"\")","v":0.33952230769230768},{"$f":"IF(AND(D15<>\"\",E15<>\"\",$D$6<>\"\",$E$6<>\"\"),$E$6*D15+$E$6*(G15+(1-$E$6)*E15)*$AB$8/$AB$5,\"\")","v":9.8951428571428565E-2},{"$f":"IF(AND(D15<>\"\",F15<>\"\",$F$6<>\"\",$G$6<>\"\"),$F$6*D15/(1-$G$6*F15),\"\")","v":0},{"$f":"IF(AND(D15<>\"\",E15<>\"\",$F$6<>\"\",$H$6<>\"\"),$F$6*D15/(1-$H$6*E15),\"\")","v":0},{"$f":"IF(AND(K15<>\"\", N15<>\"\"),K15-N15,\"\")","v":2.6470588235294117E-2},{"$f":"IF(AND(L15<>\"\", O15<>\"\"),L15-O15,\"\")","v":0.33952230769230768},{"$f":"IF(AND(H15<>\"\",J15<>\"\",$I$6<>\"\",$J$6<>\"\"),$I$6*H15/(1-$J$6*J15),\"\")","v":0},{"$f":"IF(AND(H15<>\"\",I15<>\"\",$I$6<>\"\",$K$6<>\"\"),$I$6*H15/(1-$K$6*I15),\"\")","v":0},null,{"$f":"IF(AND(K15<>\"\",$E$6<>\"\"),K15/$E$6,\"\")","v":4.4865403788634101E-2},{"$f":"IF(AND(L15<>\"\",$E$6<>\"\"),L15/$E$6,\"\")","v":0.57546153846153847},{"$f":"IF(AND(M15<>\"\",$E$6<>\"\"),M15/$E$6,\"\")","v":0.1677142857142857}]
[null,{"$f":"'Solar prot device - data'!B16","v":2},{"$f":"IF('Solar prot device - data'!C16<>\"\",C$6&\" + \"&'Solar prot device - data'!C16,\"\")","v":"Your glazing + Opaque - Pastel"},{"$f":"IF('Solar prot device - data'!D16<>\"\",'Solar prot device - data'!D16,\"\")","v":0},{"$f":"IF('Solar prot device - data'!E16<>\"\",'Solar prot device - data'!E16,\"\")","v":0.5},{"$f":"IF('Solar prot device - data'!F16<>\"\",'Solar prot device - data'!F16,\"\")","v":0.5},{"$f":"IF('Solar prot device - data'!G16<>\"\",'Solar prot device - data'!G16,\"\")","v":0.5},{"$f":"IF('Solar prot device - data'!H16<>\"\",'Solar prot device - data'!H16,\"\")","v":0},{"$f":"IF('Solar prot device - data'!I16<>\"\",'Solar prot device - data'!I16,\"\")","v":0.5},{"$f":"IF('Solar prot device - data'!J16<>\"\",'Solar prot device - data'!J16,\"\")","v":0.5},4.4117647058823525E-2,0.40460384615384615,0.11884285714285715,0,0,{"$f":"IF(AND(K16<>\"\", N16<>\"\"),K16-N16,\"\")","v":4.4117647058823525E-2},{"$f":"IF(AND(L16<>\"\", O16<>\"\"),L16-O16,\"\")","v":0.40460384615384615},0,0,null,7.477567298105682E-2,0.6857692307692308,0.20142857142857146]
[null,{"$f":"'Solar prot device - data'!B17","v":3},{"$f":"IF('Solar prot device - data'!C17<>\"\",C$6&\" + \"&'Solar prot device - data'!C17,\"\")","v":"Your glazing + Opaque - Dark"},{"$f":"IF('Solar prot device - data'!D17<>\"\",'Solar prot device - data'!D17,\"\")","v":0},{"$f":"IF('Solar prot device - data'!E17<>\"\",'Solar prot device - data'!E17,\"\")","v":0.3},{"$f":"IF('Solar prot device - data'!F17<>\"\",'Solar prot device - data'!F17,\"\")","v":0.3},{"$f":"IF('Solar prot device - data'!G17<>\"\",'Solar prot device - data'!G17,\"\")","v":0.7},{"$f":"IF('Solar prot device - data'!H17<>\"\",'Solar prot device - data'!H17,\"\")","v":0},{"$f":"IF('Solar prot device - data'!I17<>\"\",'Solar prot device - data'!I17,\"\")","v":0.3},{"$f":"IF('Solar prot device - data'!J17<>\"\",'Solar prot device - data'!J17,\"\")","v":0.3},6.176470588235293E-2,0.46968538461538456,0.1387342857142857,0,0,6.176470588235293E-2,0.46968538461538456,0,0,null,0.10468594217347955,0.79607692307692302,0.23514285714285713]
[null,{"$f":"'Solar prot device - data'!B18","v":4},{"$f":"IF('Solar prot device - data'!C18<>\"\",C$6&\" + \"&'Solar prot device - data'!C18,\"\")","v":"Your glazing + Opaque - Black"},{"$f":"IF('Solar prot device - data'!D18<>\"\",'Solar prot device - data'!D18,\"\")","v":0},{"$f":"IF('Solar prot device - data'!E18<>\"\",'Solar prot device - data'!E18,\"\")","v":0.1},{"$f":"IF('Solar prot device - data'!F18<>\"\",'Solar prot device - data'!F18,\"\")","v":0.1},{"$f":"IF('Solar prot device - data'!G18<>\"\",'Solar prot device - data'!G18,\"\")","v":0.9},{"$f":"IF('Solar prot device - data'!H18<>\"\",'Solar prot device - data'!H18,\"\")","v":0},{"$f":"IF('Solar prot device - data'!I18<>\"\",'Solar prot device - data'!I18,\"\")","v":0.1},{"$f":"IF('Solar prot device - data'!J18<>\"\",'Solar prot device - data'!J18,\"\")","v":0.1},7.9411764705882334E-2,0.53476692307692308,0.15862571428571426,0,0,7.9411764705882334E-2,0.53476692307692308,0,0,null,0.13459621136590227,0.90638461538461546,0.26885714285714285]
[null,{"$f":"'Solar prot device - data'!B19","v":5},{"$f":"IF('Solar prot device - data'!C19<>\"\",C$6&\" + \"&'Solar prot device - data'!C19,\"\")","v":"Your glazing + Medium translucent - White"},{"$f":"IF('Solar prot device - data'!D19<>\"\",'Solar prot device - data'!D19,\"\")","v":0.2},{"$f":"IF('Solar prot device - data'!E19<>\"\",'Solar prot device - data'!E19,\"\")","v":0.6},{"$f":"IF('Solar prot device - data'!F19<>\"\",'Solar prot device - data'!F19,\"\")","v":0.6},{"$f":"IF('Solar prot device - data'!G19<>\"\",'Solar prot device - data'!G19,\"\")","v":0.20000000000000007},{"$f":"IF('Solar prot device - data'!H19<>\"\",'Solar prot device - data'!H19,\"\")","v":0.2},{"$f":"IF('Solar prot device - data'!I19<>\"\",'Solar prot device - data'!I19,\"\")","v":0.6},{"$f":"IF('Solar prot device - data'!J19<>\"\",'Solar prot device - data'!J19,\"\")","v":0.6},0.15011764705882352,0.37660153846153849,0.19318285714285716,0.11368909512761022,0.11864406779661016,3.6428551931213304E-2,0.25795747066492836,0.17582417582417587,0.17021276595744686,null,0.25443668993020935,0.63830769230769235,0.32742857142857146]
[null,{"$f":"'Solar prot device - data'!B20","v":6},{"$f":"IF('Solar prot device - data'!C20<>\"\",C$6&\" + \"&'Solar prot device - data'!C20,\"\")","v":"Your glazing + Medium translucent - Pastel"},{"$f":"IF('Solar prot device - data'!D20<>\"\",'Solar prot device - data'!D20,\"\")","v":0.2},{"$f":"IF('Solar prot device - data'!E20<>\"\",'Solar prot device - data'!E20,\"\")","v":0.4},{"$f":"IF('Solar prot device - data'!F20<>\"\",'Solar prot device - data'!F20,\"\")","v":0.4},{"$f":"IF('Solar prot device - data'!G20<>\"\",'Solar prot device - data'!G20,\"\")","v":0.4},{"$f":"IF('Solar prot device - data'!H20<>\"\",'Solar prot device - data'!H20,\"\")","v":0.2},{"$f":"IF('Solar prot device - data'!I20<>\"\",'Solar prot device - data'!I20,\"\")","v":0.4},{"$f":"IF('Solar prot device - data'!J20<>\"\",'Solar prot device - data'!J20,\"\")","v":0.4},0.16776470588235293,0.44168307692307696,0.21307428571428572,0.10792951541850221,0.11085972850678734,5.9835190463850718E-2,0.33082334841628963,0.17021276595744686,0.16666666666666671,null,0.28434695912263208,0.74861538461538468,0.36114285714285715]
[null,{"$f":"'Solar prot device - data'!B21","v":7},{"$f":"IF('Solar prot device - data'!C21<>\"\",C$6&\" + \"&'Solar prot device - data'!C21,\"\")","v":"Your glazing + Medium translucent - Dark"},{"$f":"IF('Solar prot device - data'!D21<>\"\",'Solar prot device - data'!D21,\"\")","v":0.2},{"$f":"IF('Solar prot device - data'!E21<>\"\",'Solar prot device - data'!E21,\"\")","v":0.2},{"$f":"IF('Solar prot device - data'!F21<>\"\",'Solar prot device - data'!F21,\"\")","v":0.2},{"$f":"IF('Solar prot device - data'!G21<>\"\",'Solar prot device - data'!G21,\"\")","v":0.60000000000000009},{"$f":"IF('Solar prot device - data'!H21<>\"\",'Solar prot device - data'!H21,\"\")","v":0.2},{"$f":"IF('Solar prot device - data'!I21<>\"\",'Solar prot device - data'!I21,\"\")","v":0.2},{"$f":"IF('Solar prot device - data'!J21<>\"\",'Solar prot device - data'!J21,\"\")","v":0.2},0.18541176470588236,0.50676461538461537,0.23296571428571428,0.10272536687631029,0.1040339702760085,8.2686397829572073E-2,0.4027306451086069,0.16494845360824745,0.16326530612244902,null,0.31425722831505487,0.8589230769230769,0.39485714285714285]
[null,{"$f":"'Solar prot device - data'!B22","v":8},{"$f":"IF('Solar prot device - data'!C22<>\"\",C$6&\" + \"&'Solar prot device - data'!C22,\"\")","v":"Your glazing + Medium translucent - Black"},{"$f":"IF('Solar prot device - data'!D22<>\"\",'Solar prot device - data'!D22,\"\")","v":0.2},{"$f":"IF('Solar prot device - data'!E22<>\"\",'Solar prot device - data'!E22,\"\")","v":0.1},{"$f":"IF('Solar prot device - data'!F22<>\"\",'Solar prot device - data'!F22,\"\")","v":0.1},{"$f":"IF('Solar prot device - data'!G22<>\"\",'Solar prot device - data'!G22,\"\")","v":0.70000000000000007},{"$f":"IF('Solar prot device - data'!H22<>\"\",'Solar prot device - data'!H22,\"\")","v":0.2},{"$f":"IF('Solar prot device - data'!I22<>\"\",'Solar prot device - data'!I22,\"\")","v":0.1},{"$f":"IF('Solar prot device - data'!J22<>\"\",'Solar prot device - data'!J22,\"\")","v":0.1},0.19423529411764706,0.53930538461538458,0.24291142857142856,0.10030706243602866,0.10092687950566427,9.3928231681618402E-2,0.43837850510972032,0.1624365482233503,0.16161616161616166,null,0.32921236291126621,0.91407692307692301,0.4117142857142857]
[null,{"$f":"'Solar prot device - data'!B23","v":9},{"$f":"IF('Solar prot device - data'!C23<>\"\",C$6&\" + \"&'Solar prot device - data'!C23,\"\")","v":"Your glazing + High translucent - White"},{"$f":"IF('Solar prot device - data'!D23<>\"\",'Solar prot device - data'!D23,\"\")","v":0.4},{"$f":"IF('Solar prot device - data'!E23<>\"\",'Solar prot device - data'!E23,\"\")","v":0.4},{"$f":"IF('Solar prot device - data'!F23<>\"\",'Solar prot device - data'!F23,\"\")","v":0.4},{"$f":"IF('Solar prot device - data'!G23<>\"\",'Solar prot device - data'!G23,\"\")","v":0.19999999999999996},{"$f":"IF('Solar prot device - data'!H23<>\"\",'Solar prot device - data'!H23,\"\")","v":0.4},{"$f":"IF('Solar prot device - data'!I23<>\"\",'Solar prot device - data'!I23,\"\")","v":0.4},{"$f":"IF('Solar prot device - data'!J23<>\"\",'Solar prot device - data'!J23,\"\")","v":0.4},0.28258823529411764,0.44622153846153845,0.29735999999999996,0.21585903083700442,0.22171945701357468,6.6729204457113223E-2,0.22450208144796377,0.34042553191489372,0.33333333333333343,null,0.47896311066799602,0.75630769230769235,0.504]
[null,{"$f":"'Solar prot device - data'!B24","v":10},{"$f":"IF('Solar prot device - data'!C24<>\"\",C$6&\" + \"&'Solar prot device - data'!C24,\"\")","v":"Your glazing + High translucent - Pastel"},{"$f":"IF('Solar prot device - data'!D24<>\"\",'Solar prot device - data'!D24,\"\")","v":0.4},{"$f":"IF('Solar prot device - data'!E24<>\"\",'Solar prot device - data'!E24,\"\")","v":0.3},{"$f":"IF('Solar prot device - data'!F24<>\"\",'Solar prot device - data'!F24,\"\")","v":0.3},{"$f":"IF('Solar prot device - data'!G24<>\"\",'Solar prot device - data'!G24,\"\")","v":0.3},{"$f":"IF('Solar prot device - data'!H24<>\"\",'Solar prot device - data'!H24,\"\")","v":0.4},{"$f":"IF('Solar prot device - data'!I24<>\"\",'Solar prot device - data'!I24,\"\")","v":0.3},{"$f":"IF('Solar prot device - data'!J24<>\"\",'Solar prot device - data'!J24,\"\")","v":0.3},0.29141176470588237,0.47876230769230765,0.30730571428571429,0.21052631578947367,0.21467688937568455,8.0885448916408698E-2,0.26408541831662313,0.33507853403141369,0.32989690721649489,null,0.49391824526420741,0.81146153846153846,0.52085714285714291]
[null,{"$f":"'Solar prot device - data'!B25","v":11},{"$f":"IF('Solar prot device - data'!C25<>\"\",C$6&\" + \"&'Solar prot device - data'!C25,\"\")","v":"Your glazing + High translucent - Dark"},{"$f":"IF('Solar prot device - data'!D25<>\"\",'Solar prot device - data'!D25,\"\")","v":0.4},{"$f":"IF('Solar prot device - data'!E25<>\"\",'Solar prot device - data'!E25,\"\")","v":0.2},{"$f":"IF('Solar prot device - data'!F25<>\"\",'Solar prot device - data'!F25,\"\")","v":0.2},{"$f":"IF('Solar prot device - data'!G25<>\"\",'Solar prot device - data'!G25,\"\")","v":0.39999999999999997},{"$f":"IF('Solar prot device - data'!H25<>\"\",'Solar prot device - data'!H25,\"\")","v":0.4},{"$f":"IF('Solar prot device - data'!I25<>\"\",'Solar prot device - data'!I25,\"\")","v":0.2},{"$f":"IF('Solar prot device - data'!J25<>\"\",'Solar prot device - data'!J25,\"\")","v":0.2},0.30023529411764704,0.51130307692307697,0.31725142857142852,0.20545073375262057,0.20806794055201699,9.4784560365026471E-2,0.30323513637105998,0.32989690721649489,0.32653061224489804,null,0.5088733798604187,0.86661538461538479,0.5377142857142857]
[null,{"$f":"'Solar prot device - data'!B26","v":12},{"$f":"IF('Solar prot device - data'!C26<>\"\",C$6&\" + \"&'Solar prot device - data'!C26,\"\")","v":"Your glazing + High translucent - Black"},{"$f":"IF('Solar prot device - data'!D26<>\"\",'Solar prot device - data'!D26,\"\")","v":0.4},{"$f":"IF('Solar prot device - data'!E26<>\"\",'Solar prot device - data'!E26,\"\")","v":0.1},{"$f":"IF('Solar prot device - data'!F26<>\"\",'Solar prot device - data'!F26,\"\")","v":0.1},{"$f":"IF('Solar prot device - data'!G26<>\"\",'Solar prot device - data'!G26,\"\")","v":0.5},{"$f":"IF('Solar prot device - data'!H26<>\"\",'Solar prot device - data'!H26,\"\")","v":0.4},{"$f":"IF('Solar prot device - data'!I26<>\"\",'Solar prot device - data'!I26,\"\")","v":0.1},{"$f":"IF('Solar prot device - data'!J26<>\"\",'Solar prot device - data'!J26,\"\")","v":0.1},0.30905882352941177,0.54384384615384618,0.32719714285714285,0.20061412487205732,0.20185375901132854,0.10844469865735445,0.34199008714251766,0.32487309644670059,0.32323232323232332,null,0.52382851445663015,0.9217692307692309,0.5545714285714286]
[null,{"$f":"'Solar prot device - data'!B27","v":13},{"$f":"IF('Solar prot device - data'!C27<>\"\",C$6&\" + \"&'Solar prot device - data'!C27,\"\")","v":""},{"$f":"IF('Solar prot device - data'!D27<>\"\",'Solar prot device - data'!D27,\"\")","v":""},{"$f":"IF('Solar prot device - data'!E27<>\"\",'Solar prot device - data'!E27,\"\")","v":""},{"$f":"IF('Solar prot device - data'!F27<>\"\",'Solar prot device - data'!F27,\"\")","v":""},{"$f":"IF('Solar prot device - data'!G27<>\"\",'Solar prot device - data'!G27,\"\")","v":""},{"$f":"IF('Solar prot device - data'!H27<>\"\",'Solar prot device - data'!H27,\"\")","v":""},{"$f":"IF('Solar prot device - data'!I27<>\"\",'Solar prot device - data'!I27,\"\")","v":""},{"$f":"IF('Solar prot device - data'!J27<>\"\",'Solar prot device - data'!J27,\"\")","v":""},"","","","","","","","","",null,"","",""]
[null,{"$f":"'Solar prot device - data'!B28","v":14},{"$f":"IF('Solar prot device - data'!C28<>\"\",C$6&\" + \"&'Solar prot device - data'!C28,\"\")","v":""},{"$f":"IF('Solar prot device - data'!D28<>\"\",'Solar prot device - data'!D28,\"\")","v":""},{"$f":"IF('Solar prot device - data'!E28<>\"\",'Solar prot device - data'!E28,\"\")","v":""},{"$f":"IF('Solar prot device - data'!F28<>\"\",'Solar prot device - data'!F28,\"\")","v":""},{"$f":"IF('Solar prot device - data'!G28<>\"\",'Solar prot device - data'!G28,\"\")","v":""},{"$f":"IF('Solar prot device - data'!H28<>\"\",'Solar prot device - data'!H28,\"\")","v":""},{"$f":"IF('Solar prot device - data'!I28<>\"\",'Solar prot device - data'!I28,\"\")","v":""},{"$f":"IF('Solar prot device - data'!J28<>\"\",'Solar prot device - data'!J28,\"\")","v":""},"","","","","","","","","",null,"","",""]
[null,{"$f":"'Solar prot device - data'!B29","v":15},{"$f":"IF('Solar prot device - data'!C29<>\"\",C$6&\" + \"&'Solar prot device - data'!C29,\"\")","v":""},{"$f":"IF('Solar prot device - data'!D29<>\"\",'Solar prot device - data'!D29,\"\")","v":""},{"$f":"IF('Solar prot device - data'!E29<>\"\",'Solar prot device - data'!E29,\"\")","v":""},{"$f":"IF('Solar prot device - data'!F29<>\"\",'Solar prot device - data'!F29,\"\")","v":""},{"$f":"IF('Solar prot device - data'!G29<>\"\",'Solar prot device - data'!G29,\"\")","v":""},{"$f":"IF('Solar prot device - data'!H29<>\"\",'Solar prot device - data'!H29,\"\")","v":""},{"$f":"IF('Solar prot device - data'!I29<>\"\",'Solar prot device - data'!I29,\"\")","v":""},{"$f":"IF('Solar prot device - data'!J29<>\"\",'Solar prot device - data'!J29,\"\")","v":""},"","","","","","","","","",null,"","",""]
[null,{"$f":"'Solar prot device - data'!B30","v":16},{"$f":"IF('Solar prot device - data'!C30<>\"\",C$6&\" + \"&'Solar prot device - data'!C30,\"\")","v":""},{"$f":"IF('Solar prot device - data'!D30<>\"\",'Solar prot device - data'!D30,\"\")","v":""},{"$f":"IF('Solar prot device - data'!E30<>\"\",'Solar prot device - data'!E30,\"\")","v":""},{"$f":"IF('Solar prot device - data'!F30<>\"\",'Solar prot device - data'!F30,\"\")","v":""},{"$f":"IF('Solar prot device - data'!G30<>\"\",'Solar prot device - data'!G30,\"\")","v":""},{"$f":"IF('Solar prot device - data'!H30<>\"\",'Solar prot device - data'!H30,\"\")","v":""},{"$f":"IF('Solar prot device - data'!I30<>\"\",'Solar prot device - data'!I30,\"\")","v":""},{"$f":"IF('Solar prot device - data'!J30<>\"\",'Solar prot device - data'!J30,\"\")","v":""},"","","","","","","","","",null,"","",""]
[null,{"$f":"'Solar prot device - data'!B31","v":17},{"$f":"IF('Solar prot device - data'!C31<>\"\",C$6&\" + \"&'Solar prot device - data'!C31,\"\")","v":""},{"$f":"IF('Solar prot device - data'!D31<>\"\",'Solar prot device - data'!D31,\"\")","v":""},{"$f":"IF('Solar prot device - data'!E31<>\"\",'Solar prot device - data'!E31,\"\")","v":""},{"$f":"IF('Solar prot device - data'!F31<>\"\",'Solar prot device - data'!F31,\"\")","v":""},{"$f":"IF('Solar prot device - data'!G31<>\"\",'Solar prot device - data'!G31,\"\")","v":""},{"$f":"IF('Solar prot device - data'!H31<>\"\",'Solar prot device - data'!H31,\"\")","v":""},{"$f":"IF('Solar prot device - data'!I31<>\"\",'Solar prot device - data'!I31,\"\")","v":""},{"$f":"IF('Solar prot device - data'!J31<>\"\",'Solar prot device - data'!J31,\"\")","v":""},"","","","","","","","","",null,"","",""]
[null,{"$f":"'Solar prot device - data'!B32","v":18},{"$f":"IF('Solar prot device - data'!C32<>\"\",C$6&\" + \"&'Solar prot device - data'!C32,\"\")","v":""},{"$f":"IF('Solar prot device - data'!D32<>\"\",'Solar prot device - data'!D32,\"\")","v":""},{"$f":"IF('Solar prot device - data'!E32<>\"\",'Solar prot device - data'!E32,\"\")","v":""},{"$f":"IF('Solar prot device - data'!F32<>\"\",'Solar prot device - data'!F32,\"\")","v":""},{"$f":"IF('Solar prot device - data'!G32<>\"\",'Solar prot device - data'!G32,\"\")","v":""},{"$f":"IF('Solar prot device - data'!H32<>\"\",'Solar prot device - data'!H32,\"\")","v":""},{"$f":"IF('Solar prot device - data'!I32<>\"\",'Solar prot device - data'!I32,\"\")","v":""},{"$f":"IF('Solar prot device - data'!J32<>\"\",'Solar prot device - data'!J32,\"\")","v":""},"","","","","","","","","",null,"","",""]
[null,{"$f":"'Solar prot device - data'!B33","v":19},{"$f":"IF('Solar prot device - data'!C33<>\"\",C$6&\" + \"&'Solar prot device - data'!C33,\"\")","v":""},{"$f":"IF('Solar prot device - data'!D33<>\"\",'Solar prot device - data'!D33,\"\")","v":""},{"$f":"IF('Solar prot device - data'!E33<>\"\",'Solar prot device - data'!E33,\"\")","v":""},{"$f":"IF('Solar prot device - data'!F33<>\"\",'Solar prot device - data'!F33,\"\")","v":""},{"$f":"IF('Solar prot device - data'!G33<>\"\",'Solar prot device - data'!G33,\"\")","v":""},{"$f":"IF('Solar prot device - data'!H33<>\"\",'Solar prot device - data'!H33,\"\")","v":""},{"$f":"IF('Solar prot device - data'!I33<>\"\",'Solar prot device - data'!I33,\"\")","v":""},{"$f":"IF('Solar prot device - data'!J33<>\"\",'Solar prot device - data'!J33,\"\")","v":""},"","","","","","","","","",null,"","",""]
[null,{"$f":"'Solar prot device - data'!B34","v":20},{"$f":"IF('Solar prot device - data'!C34<>\"\",C$6&\" + \"&'Solar prot device - data'!C34,\"\")","v":""},{"$f":"IF('Solar prot device - data'!D34<>\"\",'Solar prot device - data'!D34,\"\")","v":""},{"$f":"IF('Solar prot device - data'!E34<>\"\",'Solar prot device - data'!E34,\"\")","v":""},{"$f":"IF('Solar prot device - data'!F34<>\"\",'Solar prot device - data'!F34,\"\")","v":""},{"$f":"IF('Solar prot device - data'!G34<>\"\",'Solar prot device - data'!G34,\"\")","v":""},{"$f":"IF('Solar prot device - data'!H34<>\"\",'Solar prot device - data'!H34,\"\")","v":""},{"$f":"IF('Solar prot device - data'!I34<>\"\",'Solar prot device - data'!I34,\"\")","v":""},{"$f":"IF('Solar prot device - data'!J34<>\"\",'Solar prot device - data'!J34,\"\")","v":""},"","","","","","","","","",null,"","",""]
[null,{"$f":"'Solar prot device - data'!B35","v":21},{"$f":"IF('Solar prot device - data'!C35<>\"\",C$6&\" + \"&'Solar prot device - data'!C35,\"\")","v":""},{"$f":"IF('Solar prot device - data'!D35<>\"\",'Solar prot device - data'!D35,\"\")","v":""},{"$f":"IF('Solar prot device - data'!E35<>\"\",'Solar prot device - data'!E35,\"\")","v":""},{"$f":"IF('Solar prot device - data'!F35<>\"\",'Solar prot device - data'!F35,\"\")","v":""},{"$f":"IF('Solar prot device - data'!G35<>\"\",'Solar prot device - data'!G35,\"\")","v":""},{"$f":"IF('Solar prot device - data'!H35<>\"\",'Solar prot device - data'!H35,\"\")","v":""},{"$f":"IF('Solar prot device - data'!I35<>\"\",'Solar prot device - data'!I35,\"\")","v":""},{"$f":"IF('Solar prot device - data'!J35<>\"\",'Solar prot device - data'!J35,\"\")","v":""},"","","","","","","","","",null,"","",""]
[null,{"$f":"'Solar prot device - data'!B36","v":22},{"$f":"IF('Solar prot device - data'!C36<>\"\",C$6&\" + \"&'Solar prot device - data'!C36,\"\")","v":""},{"$f":"IF('Solar prot device - data'!D36<>\"\",'Solar prot device - data'!D36,\"\")","v":""},{"$f":"IF('Solar prot device - data'!E36<>\"\",'Solar prot device - data'!E36,\"\")","v":""},{"$f":"IF('Solar prot device - data'!F36<>\"\",'Solar prot device - data'!F36,\"\")","v":""},{"$f":"IF('Solar prot device - data'!G36<>\"\",'Solar prot device - data'!G36,\"\")","v":""},{"$f":"IF('Solar prot device - data'!H36<>\"\",'Solar prot device - data'!H36,\"\")","v":""},{"$f":"IF('Solar prot device - data'!I36<>\"\",'Solar prot device - data'!I36,\"\")","v":""},{"$f":"IF('Solar prot device - data'!J36<>\"\",'Solar prot device - data'!J36,\"\")","v":""},"","","","","","","","","",null,"","",""]
[null,{"$f":"'Solar prot device - data'!B37","v":23},{"$f":"IF('Solar prot device - data'!C37<>\"\",C$6&\" + \"&'Solar prot device - data'!C37,\"\")","v":""},{"$f":"IF('Solar prot device - data'!D37<>\"\",'Solar prot device - data'!D37,\"\")","v":""},{"$f":"IF('Solar prot device - data'!E37<>\"\",'Solar prot device - data'!E37,\"\")","v":""},{"$f":"IF('Solar prot device - data'!F37<>\"\",'Solar prot device - data'!F37,\"\")","v":""},{"$f":"IF('Solar prot device - data'!G37<>\"\",'Solar prot device - data'!G37,\"\")","v":""},{"$f":"IF('Solar prot device - data'!H37<>\"\",'Solar prot device - data'!H37,\"\")","v":""},{"$f":"IF('Solar prot device - data'!I37<>\"\",'Solar prot device - data'!I37,\"\")","v":""},{"$f":"IF('Solar prot device - data'!J37<>\"\",'Solar prot device - data'!J37,\"\")","v":""},"","","","","","","","","",null,"","",""]
[null,{"$f":"'Solar prot device - data'!B38","v":24},{"$f":"IF('Solar prot device - data'!C38<>\"\",C$6&\" + \"&'Solar prot device - data'!C38,\"\")","v":""},{"$f":"IF('Solar prot device - data'!D38<>\"\",'Solar prot device - data'!D38,\"\")","v":""},{"$f":"IF('Solar prot device - data'!E38<>\"\",'Solar prot device - data'!E38,\"\")","v":""},{"$f":"IF('Solar prot device - data'!F38<>\"\",'Solar prot device - data'!F38,\"\")","v":""},{"$f":"IF('Solar prot device - data'!G38<>\"\",'Solar prot device - data'!G38,\"\")","v":""},{"$f":"IF('Solar prot device - data'!H38<>\"\",'Solar prot device - data'!H38,\"\")","v":""},{"$f":"IF('Solar prot device - data'!I38<>\"\",'Solar prot device - data'!I38,\"\")","v":""},{"$f":"IF('Solar prot device - data'!J38<>\"\",'Solar prot device - data'!J38,\"\")","v":""},"","","","","","","","","",null,"","",""]
[null,{"$f":"'Solar prot device - data'!B39","v":25},{"$f":"IF('Solar prot device - data'!C39<>\"\",C$6&\" + \"&'Solar prot device - data'!C39,\"\")","v":""},{"$f":"IF('Solar prot device - data'!D39<>\"\",'Solar prot device - data'!D39,\"\")","v":""},{"$f":"IF('Solar prot device - data'!E39<>\"\",'Solar prot device - data'!E39,\"\")","v":""},{"$f":"IF('Solar prot device - data'!F39<>\"\",'Solar prot device - data'!F39,\"\")","v":""},{"$f":"IF('Solar prot device - data'!G39<>\"\",'Solar prot device - data'!G39,\"\")","v":""},{"$f":"IF('Solar prot device - data'!H39<>\"\",'Solar prot device - data'!H39,\"\")","v":""},{"$f":"IF('Solar prot device - data'!I39<>\"\",'Solar prot device - data'!I39,\"\")","v":""},{"$f":"IF('Solar prot device - data'!J39<>\"\",'Solar prot device - data'!J39,\"\")","v":""},"","","","","","","","","",null,"","",""]
[null,{"$f":"'Solar prot device - data'!B40","v":26},{"$f":"IF('Solar prot device - data'!C40<>\"\",C$6&\" + \"&'Solar prot device - data'!C40,\"\")","v":""},{"$f":"IF('Solar prot device - data'!D40<>\"\",'Solar prot device - data'!D40,\"\")","v":""},{"$f":"IF('Solar prot device - data'!E40<>\"\",'Solar prot device - data'!E40,\"\")","v":""},{"$f":"IF('Solar prot device - data'!F40<>\"\",'Solar prot device - data'!F40,\"\")","v":""},{"$f":"IF('Solar prot device - data'!G40<>\"\",'Solar prot device - data'!G40,\"\")","v":""},{"$f":"IF('Solar prot device - data'!H40<>\"\",'Solar prot device - data'!H40,\"\")","v":""},{"$f":"IF('Solar prot device - data'!I40<>\"\",'Solar prot device - data'!I40,\"\")","v":""},{"$f":"IF('Solar prot device - data'!J40<>\"\",'Solar prot device - data'!J40,\"\")","v":""},"","","","","","","","","",null,"","",""]
[null,{"$f":"'Solar prot device - data'!B41","v":27},{"$f":"IF('Solar prot device - data'!C41<>\"\",C$6&\" + \"&'Solar prot device - data'!C41,\"\")","v":""},{"$f":"IF('Solar prot device - data'!D41<>\"\",'Solar prot device - data'!D41,\"\")","v":""},{"$f":"IF('Solar prot device - data'!E41<>\"\",'Solar prot device - data'!E41,\"\")","v":""},{"$f":"IF('Solar prot device - data'!F41<>\"\",'Solar prot device - data'!F41,\"\")","v":""},{"$f":"IF('Solar prot device - data'!G41<>\"\",'Solar prot device - data'!G41,\"\")","v":""},{"$f":"IF('Solar prot device - data'!H41<>\"\",'Solar prot device - data'!H41,\"\")","v":""},{"$f":"IF('Solar prot device - data'!I41<>\"\",'Solar prot device - data'!I41,\"\")","v":""},{"$f":"IF('Solar prot device - data'!J41<>\"\",'Solar prot device - data'!J41,\"\")","v":""},"","","","","","","","","",null,"","",""]
[null,{"$f":"'Solar prot device - data'!B42","v":28},{"$f":"IF('Solar prot device - data'!C42<>\"\",C$6&\" + \"&'Solar prot device - data'!C42,\"\")","v":""},{"$f":"IF('Solar prot device - data'!D42<>\"\",'Solar prot device - data'!D42,\"\")","v":""},{"$f":"IF('Solar prot device - data'!E42<>\"\",'Solar prot device - data'!E42,\"\")","v":""},{"$f":"IF('Solar prot device - data'!F42<>\"\",'Solar prot device - data'!F42,\"\")","v":""},{"$f":"IF('Solar prot device - data'!G42<>\"\",'Solar prot device - data'!G42,\"\")","v":""},{"$f":"IF('Solar prot device - data'!H42<>\"\",'Solar prot device - data'!H42,\"\")","v":""},{"$f":"IF('Solar prot device - data'!I42<>\"\",'Solar prot device - data'!I42,\"\")","v":""},{"$f":"IF('Solar prot device - data'!J42<>\"\",'Solar prot device - data'!J42,\"\")","v":""},"","","","","","","","","",null,"","",""]
[null,{"$f":"'Solar prot device - data'!B43","v":29},{"$f":"IF('Solar prot device - data'!C43<>\"\",C$6&\" + \"&'Solar prot device - data'!C43,\"\")","v":""},{"$f":"IF('Solar prot device - data'!D43<>\"\",'Solar prot device - data'!D43,\"\")","v":""},{"$f":"IF('Solar prot device - data'!E43<>\"\",'Solar prot device - data'!E43,\"\")","v":""},{"$f":"IF('Solar prot device - data'!F43<>\"\",'Solar prot device - data'!F43,\"\")","v":""},{"$f":"IF('Solar prot device - data'!G43<>\"\",'Solar prot device - data'!G43,\"\")","v":""},{"$f":"IF('Solar prot device - data'!H43<>\"\",'Solar prot device - data'!H43,\"\")","v":""},{"$f":"IF('Solar prot device - data'!I43<>\"\",'Solar prot device - data'!I43,\"\")","v":""},{"$f":"IF('Solar prot device - data'!J43<>\"\",'Solar prot device - data'!J43,\"\")","v":""},"","","","","","","","","",null,"","",""]
[null,{"$f":"'Solar prot device - data'!B44","v":30},{"$f":"IF('Solar prot device - data'!C44<>\"\",C$6&\" + \"&'Solar prot device - data'!C44,\"\")","v":""},{"$f":"IF('Solar prot device - data'!D44<>\"\",'Solar prot device - data'!D44,\"\")","v":""},{"$f":"IF('Solar prot device - data'!E44<>\"\",'Solar prot device - data'!E44,\"\")","v":""},{"$f":"IF('Solar prot device - data'!F44<>\"\",'Solar prot device - data'!F44,\"\")","v":""},{"$f":"IF('Solar prot device - data'!G44<>\"\",'Solar prot device - data'!G44,\"\")","v":""},{"$f":"IF('Solar prot device - data'!H44<>\"\",'Solar prot device - data'!H44,\"\")","v":""},{"$f":"IF('Solar prot device - data'!I44<>\"\",'Solar prot device - data'!I44,\"\")","v":""},{"$f":"IF('Solar prot device - data'!J44<>\"\",'Solar prot device - data'!J44,\"\")","v":""},"","","","","","","","","",null,"","",""]
[null,{"$f":"'Solar prot device - data'!B45","v":31},{"$f":"IF('Solar prot device - data'!C45<>\"\",C$6&\" + \"&'Solar prot device - data'!C45,\"\")","v":""},{"$f":"IF('Solar prot device - data'!D45<>\"\",'Solar prot device - data'!D45,\"\")","v":""},{"$f":"IF('Solar prot device - data'!E45<>\"\",'Solar prot device - data'!E45,\"\")","v":""},{"$f":"IF('Solar prot device - data'!F45<>\"\",'Solar prot device - data'!F45,\"\")","v":""},{"$f":"IF('Solar prot device - data'!G45<>\"\",'Solar prot device - data'!G45,\"\")","v":""},{"$f":"IF('Solar prot device - data'!H45<>\"\",'Solar prot device - data'!H45,\"\")","v":""},{"$f":"IF('Solar prot device - data'!I45<>\"\",'Solar prot device - data'!I45,\"\")","v":""},{"$f":"IF('Solar prot device - data'!J45<>\"\",'Solar prot device - data'!J45,\"\")","v":""},"","","","","","","","","",null,"","",""]
[null,{"$f":"'Solar prot device - data'!B46","v":32},{"$f":"IF('Solar prot device - data'!C46<>\"\",C$6&\" + \"&'Solar prot device - data'!C46,\"\")","v":""},{"$f":"IF('Solar prot device - data'!D46<>\"\",'Solar prot device - data'!D46,\"\")","v":""},{"$f":"IF('Solar prot device - data'!E46<>\"\",'Solar prot device - data'!E46,\"\")","v":""},{"$f":"IF('Solar prot device - data'!F46<>\"\",'Solar prot device - data'!F46,\"\")","v":""},{"$f":"IF('Solar prot device - data'!G46<>\"\",'Solar prot device - data'!G46,\"\")","v":""},{"$f":"IF('Solar prot device - data'!H46<>\"\",'Solar prot device - data'!H46,\"\")","v":""},{"$f":"IF('Solar prot device - data'!I46<>\"\",'Solar prot device - data'!I46,\"\")","v":""},{"$f":"IF('Solar prot device - data'!J46<>\"\",'Solar prot device - data'!J46,\"\")","v":""},"","","","","","","","","",null,"","",""]
[null,{"$f":"'Solar prot device - data'!B47","v":33},{"$f":"IF('Solar prot device - data'!C47<>\"\",C$6&\" + \"&'Solar prot device - data'!C47,\"\")","v":""},{"$f":"IF('Solar prot device - data'!D47<>\"\",'Solar prot device - data'!D47,\"\")","v":""},{"$f":"IF('Solar prot device - data'!E47<>\"\",'Solar prot device - data'!E47,\"\")","v":""},{"$f":"IF('Solar prot device - data'!F47<>\"\",'Solar prot device - data'!F47,\"\")","v":""},{"$f":"IF('Solar prot device - data'!G47<>\"\",'Solar prot device - data'!G47,\"\")","v":""},{"$f":"IF('Solar prot device - data'!H47<>\"\",'Solar prot device - data'!H47,\"\")","v":""},{"$f":"IF('Solar prot device - data'!I47<>\"\",'Solar prot device - data'!I47,\"\")","v":""},{"$f":"IF('Solar prot device - data'!J47<>\"\",'Solar prot device - data'!J47,\"\")","v":""},{"$f":"IF(AND(D47<>\"\",E47<>\"\",$D$6<>\"\",$E$6<>\"\"),D47*$E$6+G47*$AB$6/$AB$3+D47*(1-$E$6)*$AB$6/$AB$2,\"\")","v":""},{"$f":"IF(AND(D47<>\"\",E47<>\"\",$D$6<>\"\",$E$6<>\"\"),$E$6*(1-$E$6*E47-G47*$AB$7/$AB$4),\"\")","v":""},{"$f":"IF(AND(D47<>\"\",E47<>\"\",$D$6<>\"\",$E$6<>\"\"),$E$6*D47+$E$6*(G47+(1-$E$6)*E47)*$AB$8/$AB$5,\"\")","v":""},{"$f":"IF(AND(D47<>\"\",F47<>\"\",$F$6<>\"\",$G$6<>\"\"),$F$6*D47/(1-$G$6*F47),\"\")","v":""},{"$f":"IF(AND(D47<>\"\",E47<>\"\",$F$6<>\"\",$H$6<>\"\"),$F$6*D47/(1-$H$6*E47),\"\")","v":""},"","",{"$f":"IF(AND(H47<>\"\",J47<>\"\",$I$6<>\"\",$J$6<>\"\"),$I$6*H47/(1-$J$6*J47),\"\")","v":""},{"$f":"IF(AND(H47<>\"\",I47<>\"\",$I$6<>\"\",$K$6<>\"\"),$I$6*H47/(1-$K$6*I47),\"\")","v":""},null,{"$f":"IF(AND(K47<>\"\",$E$6<>\"\"),K47/$E$6,\"\")","v":""},{"$f":"IF(AND(L47<>\"\",$E$6<>\"\"),L47/$E$6,\"\")","v":""},{"$f":"IF(AND(M47<>\"\",$E$6<>\"\"),M47/$E$6,\"\")","v":""}]
[null,{"$f":"'Solar prot device - data'!B48","v":34},{"$f":"IF('Solar prot device - data'!C48<>\"\",C$6&\" + \"&'Solar prot device - data'!C48,\"\")","v":""},{"$f":"IF('Solar prot device - data'!D48<>\"\",'Solar prot device - data'!D48,\"\")","v":""},{"$f":"IF('Solar prot device - data'!E48<>\"\",'Solar prot device - data'!E48,\"\")","v":""},{"$f":"IF('Solar prot device - data'!F48<>\"\",'Solar prot device - data'!F48,\"\")","v":""},{"$f":"IF('Solar prot device - data'!G48<>\"\",'Solar prot device - data'!G48,\"\")","v":""},{"$f":"IF('Solar prot device - data'!H48<>\"\",'Solar prot device - data'!H48,\"\")","v":""},{"$f":"IF('Solar prot device - data'!I48<>\"\",'Solar prot device - data'!I48,\"\")","v":""},{"$f":"IF('Solar prot device - data'!J48<>\"\",'Solar prot device - data'!J48,\"\")","v":""},"","","","","","","","","",null,"","",""]
[null,{"$f":"'Solar prot device - data'!B49","v":35},{"$f":"IF('Solar prot device - data'!C49<>\"\",C$6&\" + \"&'Solar prot device - data'!C49,\"\")","v":""},{"$f":"IF('Solar prot device - data'!D49<>\"\",'Solar prot device - data'!D49,\"\")","v":""},{"$f":"IF('Solar prot device - data'!E49<>\"\",'Solar prot device - data'!E49,\"\")","v":""},{"$f":"IF('Solar prot device - data'!F49<>\"\",'Solar prot device - data'!F49,\"\")","v":""},{"$f":"IF('Solar prot device - data'!G49<>\"\",'Solar prot device - data'!G49,\"\")","v":""},{"$f":"IF('Solar prot device - data'!H49<>\"\",'Solar prot device - data'!H49,\"\")","v":""},{"$f":"IF('Solar prot device - data'!I49<>\"\",'Solar prot device - data'!I49,\"\")","v":""},{"$f":"IF('Solar prot device - data'!J49<>\"\",'Solar prot device - data'!J49,\"\")","v":""},"","","","","","","","","",null,"","",""]
[null,{"$f":"'Solar prot device - data'!B50","v":36},{"$f":"IF('Solar prot device - data'!C50<>\"\",C$6&\" + \"&'Solar prot device - data'!C50,\"\")","v":""},{"$f":"IF('Solar prot device - data'!D50<>\"\",'Solar prot device - data'!D50,\"\")","v":""},{"$f":"IF('Solar prot device - data'!E50<>\"\",'Solar prot device - data'!E50,\"\")","v":""},{"$f":"IF('Solar prot device - data'!F50<>\"\",'Solar prot device - data'!F50,\"\")","v":""},{"$f":"IF('Solar prot device - data'!G50<>\"\",'Solar prot device - data'!G50,\"\")","v":""},{"$f":"IF('Solar prot device - data'!H50<>\"\",'Solar prot device - data'!H50,\"\")","v":""},{"$f":"IF('Solar prot device - data'!I50<>\"\",'Solar prot device - data'!I50,\"\")","v":""},{"$f":"IF('Solar prot device - data'!J50<>\"\",'Solar prot device - data'!J50,\"\")","v":""},"","","","","","","","","",null,"","",""]
[null,{"$f":"'Solar prot device - data'!B51","v":37},{"$f":"IF('Solar prot device - data'!C51<>\"\",C$6&\" + \"&'Solar prot device - data'!C51,\"\")","v":""},{"$f":"IF('Solar prot device - data'!D51<>\"\",'Solar prot device - data'!D51,\"\")","v":""},{"$f":"IF('Solar prot device - data'!E51<>\"\",'Solar prot device - data'!E51,\"\")","v":""},{"$f":"IF('Solar prot device - data'!F51<>\"\",'Solar prot device - data'!F51,\"\")","v":""},{"$f":"IF('Solar prot device - data'!G51<>\"\",'Solar prot device - data'!G51,\"\")","v":""},{"$f":"IF('Solar prot device - data'!H51<>\"\",'Solar prot device - data'!H51,\"\")","v":""},{"$f":"IF('Solar prot device - data'!I51<>\"\",'Solar prot device - data'!I51,\"\")","v":""},{"$f":"IF('Solar prot device - data'!J51<>\"\",'Solar prot device - data'!J51,\"\")","v":""},"","","","","","","","","",null,"","",""]
[null,{"$f":"'Solar prot device - data'!B52","v":38},{"$f":"IF('Solar prot device - data'!C52<>\"\",C$6&\" + \"&'Solar prot device - data'!C52,\"\")","v":""},{"$f":"IF('Solar prot device - data'!D52<>\"\",'Solar prot device - data'!D52,\"\")","v":""},{"$f":"IF('Solar prot device - data'!E52<>\"\",'Solar prot device - data'!E52,\"\")","v":""},{"$f":"IF('Solar prot device - data'!F52<>\"\",'Solar prot device - data'!F52,\"\")","v":""},{"$f":"IF('Solar prot device - data'!G52<>\"\",'Solar prot device - data'!G52,\"\")","v":""},{"$f":"IF('Solar prot device - data'!H52<>\"\",'Solar prot device - data'!H52,\"\")","v":""},{"$f":"IF('Solar prot device - data'!I52<>\"\",'Solar prot device - data'!I52,\"\")","v":""},{"$f":"IF('Solar prot device - data'!J52<>\"\",'Solar prot device - data'!J52,\"\")","v":""},"","","","","","","","","",null,"","",""]
[null,{"$f":"'Solar prot device - data'!B53","v":39},{"$f":"IF('Solar prot device - data'!C53<>\"\",C$6&\" + \"&'Solar prot device - data'!C53,\"\")","v":""},{"$f":"IF('Solar prot device - data'!D53<>\"\",'Solar prot device - data'!D53,\"\")","v":""},{"$f":"IF('Solar prot device - data'!E53<>\"\",'Solar prot device - data'!E53,\"\")","v":""},{"$f":"IF('Solar prot device - data'!F53<>\"\",'Solar prot device - data'!F53,\"\")","v":""},{"$f":"IF('Solar prot device - data'!G53<>\"\",'Solar prot device - data'!G53,\"\")","v":""},{"$f":"IF('Solar prot device - data'!H53<>\"\",'Solar prot device - data'!H53,\"\")","v":""},{"$f":"IF('Solar prot device - data'!I53<>\"\",'Solar prot device - data'!I53,\"\")","v":""},{"$f":"IF('Solar prot device - data'!J53<>\"\",'Solar prot device - data'!J53,\"\")","v":""},"","","","","","","","","",null,"","",""]
[null,{"$f":"'Solar prot device - data'!B54","v":40},{"$f":"IF('Solar prot device - data'!C54<>\"\",C$6&\" + \"&'Solar prot device - data'!C54,\"\")","v":""},{"$f":"IF('Solar prot device - data'!D54<>\"\",'Solar prot device - data'!D54,\"\")","v":""},{"$f":"IF('Solar prot device - data'!E54<>\"\",'Solar prot device - data'!E54,\"\")","v":""},{"$f":"IF('Solar prot device - data'!F54<>\"\",'Solar prot device - data'!F54,\"\")","v":""},{"$f":"IF('Solar prot device - data'!G54<>\"\",'Solar prot device - data'!G54,\"\")","v":""},{"$f":"IF('Solar prot device - data'!H54<>\"\",'Solar prot device - data'!H54,\"\")","v":""},{"$f":"IF('Solar prot device - data'!I54<>\"\",'Solar prot device - data'!I54,\"\")","v":""},{"$f":"IF('Solar prot device - data'!J54<>\"\",'Solar prot device - data'!J54,\"\")","v":""},"","","","","","","","","",null,"","",""]
[null,{"$f":"'Solar prot device - data'!B55","v":41},{"$f":"IF('Solar prot device - data'!C55<>\"\",C$6&\" + \"&'Solar prot device - data'!C55,\"\")","v":""},{"$f":"IF('Solar prot device - data'!D55<>\"\",'Solar prot device - data'!D55,\"\")","v":""},{"$f":"IF('Solar prot device - data'!E55<>\"\",'Solar prot device - data'!E55,\"\")","v":""},{"$f":"IF('Solar prot device - data'!F55<>\"\",'Solar prot device - data'!F55,\"\")","v":""},{"$f":"IF('Solar prot device - data'!G55<>\"\",'Solar prot device - data'!G55,\"\")","v":""},{"$f":"IF('Solar prot device - data'!H55<>\"\",'Solar prot device - data'!H55,\"\")","v":""},{"$f":"IF('Solar prot device - data'!I55<>\"\",'Solar prot device - data'!I55,\"\")","v":""},{"$f":"IF('Solar prot device - data'!J55<>\"\",'Solar prot device - data'!J55,\"\")","v":""},"","","","","","","","","",null,"","",""]
[null,{"$f":"'Solar prot device - data'!B56","v":42},{"$f":"IF('Solar prot device - data'!C56<>\"\",C$6&\" + \"&'Solar prot device - data'!C56,\"\")","v":""},{"$f":"IF('Solar prot device - data'!D56<>\"\",'Solar prot device - data'!D56,\"\")","v":""},{"$f":"IF('Solar prot device - data'!E56<>\"\",'Solar prot device - data'!E56,\"\")","v":""},{"$f":"IF('Solar prot device - data'!F56<>\"\",'Solar prot device - data'!F56,\"\")","v":""},{"$f":"IF('Solar prot device - data'!G56<>\"\",'Solar prot device - data'!G56,\"\")","v":""},{"$f":"IF('Solar prot device - data'!H56<>\"\",'Solar prot device - data'!H56,\"\")","v":""},{"$f":"IF('Solar prot device - data'!I56<>\"\",'Solar prot device - data'!I56,\"\")","v":""},{"$f":"IF('Solar prot device - data'!J56<>\"\",'Solar prot device - data'!J56,\"\")","v":""},"","","","","","","","","",null,"","",""]
[null,{"$f":"'Solar prot device - data'!B57","v":43},{"$f":"IF('Solar prot device - data'!C57<>\"\",C$6&\" + \"&'Solar prot device - data'!C57,\"\")","v":""},{"$f":"IF('Solar prot device - data'!D57<>\"\",'Solar prot device - data'!D57,\"\")","v":""},{"$f":"IF('Solar prot device - data'!E57<>\"\",'Solar prot device - data'!E57,\"\")","v":""},{"$f":"IF('Solar prot device - data'!F57<>\"\",'Solar prot device - data'!F57,\"\")","v":""},{"$f":"IF('Solar prot device - data'!G57<>\"\",'Solar prot device - data'!G57,\"\")","v":""},{"$f":"IF('Solar prot device - data'!H57<>\"\",'Solar prot device - data'!H57,\"\")","v":""},{"$f":"IF('Solar prot device - data'!I57<>\"\",'Solar prot device - data'!I57,\"\")","v":""},{"$f":"IF('Solar prot device - data'!J57<>\"\",'Solar prot device - data'!J57,\"\")","v":""},"","","","","","","","","",null,"","",""]
[null,{"$f":"'Solar prot device - data'!B58","v":44},{"$f":"IF('Solar prot device - data'!C58<>\"\",C$6&\" + \"&'Solar prot device - data'!C58,\"\")","v":""},{"$f":"IF('Solar prot device - data'!D58<>\"\",'Solar prot device - data'!D58,\"\")","v":""},{"$f":"IF('Solar prot device - data'!E58<>\"\",'Solar prot device - data'!E58,\"\")","v":""},{"$f":"IF('Solar prot device - data'!F58<>\"\",'Solar prot device - data'!F58,\"\")","v":""},{"$f":"IF('Solar prot device - data'!G58<>\"\",'Solar prot device - data'!G58,\"\")","v":""},{"$f":"IF('Solar prot device - data'!H58<>\"\",'Solar prot device - data'!H58,\"\")","v":""},{"$f":"IF('Solar prot device - data'!I58<>\"\",'Solar prot device - data'!I58,\"\")","v":""},{"$f":"IF('Solar prot device - data'!J58<>\"\",'Solar prot device - data'!J58,\"\")","v":""},"","","","","","","","","",null,"","",""]
[null,{"$f":"'Solar prot device - data'!B59","v":45},{"$f":"IF('Solar prot device - data'!C59<>\"\",C$6&\" + \"&'Solar prot device - data'!C59,\"\")","v":""},{"$f":"IF('Solar prot device - data'!D59<>\"\",'Solar prot device - data'!D59,\"\")","v":""},{"$f":"IF('Solar prot device - data'!E59<>\"\",'Solar prot device - data'!E59,\"\")","v":""},{"$f":"IF('Solar prot device - data'!F59<>\"\",'Solar prot device - data'!F59,\"\")","v":""},{"$f":"IF('Solar prot device - data'!G59<>\"\",'Solar prot device - data'!G59,\"\")","v":""},{"$f":"IF('Solar prot device - data'!H59<>\"\",'Solar prot device - data'!H59,\"\")","v":""},{"$f":"IF('Solar prot device - data'!I59<>\"\",'Solar prot device - data'!I59,\"\")","v":""},{"$f":"IF('Solar prot device - data'!J59<>\"\",'Solar prot device - data'!J59,\"\")","v":""},"","","","","","","","","",null,"","",""]
[null,{"$f":"'Solar prot device - data'!B60","v":46},{"$f":"IF('Solar prot device - data'!C60<>\"\",C$6&\" + \"&'Solar prot device - data'!C60,\"\")","v":""},{"$f":"IF('Solar prot device - data'!D60<>\"\",'Solar prot device - data'!D60,\"\")","v":""},{"$f":"IF('Solar prot device - data'!E60<>\"\",'Solar prot device - data'!E60,\"\")","v":""},{"$f":"IF('Solar prot device - data'!F60<>\"\",'Solar prot device - data'!F60,\"\")","v":""},{"$f":"IF('Solar prot device - data'!G60<>\"\",'Solar prot device - data'!G60,\"\")","v":""},{"$f":"IF('Solar prot device - data'!H60<>\"\",'Solar prot device - data'!H60,\"\")","v":""},{"$f":"IF('Solar prot device - data'!I60<>\"\",'Solar prot device - data'!I60,\"\")","v":""},{"$f":"IF('Solar prot device - data'!J60<>\"\",'Solar prot device - data'!J60,\"\")","v":""},"","","","","","","","","",null,"","",""]
[null,{"$f":"'Solar prot device - data'!B61","v":47},{"$f":"IF('Solar prot device - data'!C61<>\"\",C$6&\" + \"&'Solar prot device - data'!C61,\"\")","v":""},{"$f":"IF('Solar prot device - data'!D61<>\"\",'Solar prot device - data'!D61,\"\")","v":""},{"$f":"IF('Solar prot device - data'!E61<>\"\",'Solar prot device - data'!E61,\"\")","v":""},{"$f":"IF('Solar prot device - data'!F61<>\"\",'Solar prot device - data'!F61,\"\")","v":""},{"$f":"IF('Solar prot device - data'!G61<>\"\",'Solar prot device - data'!G61,\"\")","v":""},{"$f":"IF('Solar prot device - data'!H61<>\"\",'Solar prot device - data'!H61,\"\")","v":""},{"$f":"IF('Solar prot device - data'!I61<>\"\",'Solar prot device - data'!I61,\"\")","v":""},{"$f":"IF('Solar prot device - data'!J61<>\"\",'Solar prot device - data'!J61,\"\")","v":""},"","","","","","","","","",null,"","",""]
[null,{"$f":"'Solar prot device - data'!B62","v":48},{"$f":"IF('Solar prot device - data'!C62<>\"\",C$6&\" + \"&'Solar prot device - data'!C62,\"\")","v":""},{"$f":"IF('Solar prot device - data'!D62<>\"\",'Solar prot device - data'!D62,\"\")","v":""},{"$f":"IF('Solar prot device - data'!E62<>\"\",'Solar prot device - data'!E62,\"\")","v":""},{"$f":"IF('Solar prot device - data'!F62<>\"\",'Solar prot device - data'!F62,\"\")","v":""},{"$f":"IF('Solar prot device - data'!G62<>\"\",'Solar prot device - data'!G62,\"\")","v":""},{"$f":"IF('Solar prot device - data'!H62<>\"\",'Solar prot device - data'!H62,\"\")","v":""},{"$f":"IF('Solar prot device - data'!I62<>\"\",'Solar prot device - data'!I62,\"\")","v":""},{"$f":"IF('Solar prot device - data'!J62<>\"\",'Solar prot device - data'!J62,\"\")","v":""},"","","","","","","","","",null,"","",""]
[null,{"$f":"'Solar prot device - data'!B63","v":49},{"$f":"IF('Solar prot device - data'!C63<>\"\",C$6&\" + \"&'Solar prot device - data'!C63,\"\")","v":""},{"$f":"IF('Solar prot device - data'!D63<>\"\",'Solar prot device - data'!D63,\"\")","v":""},{"$f":"IF('Solar prot device - data'!E63<>\"\",'Solar prot device - data'!E63,\"\")","v":""},{"$f":"IF('Solar prot device - data'!F63<>\"\",'Solar prot device - data'!F63,\"\")","v":""},{"$f":"IF('Solar prot device - data'!G63<>\"\",'Solar prot device - data'!G63,\"\")","v":""},{"$f":"IF('Solar prot device - data'!H63<>\"\",'Solar prot device - data'!H63,\"\")","v":""},{"$f":"IF('Solar prot device - data'!I63<>\"\",'Solar prot device - data'!I63,\"\")","v":""},{"$f":"IF('Solar prot device - data'!J63<>\"\",'Solar prot device - data'!J63,\"\")","v":""},"","","","","","","","","",null,"","",""]
[null,{"$f":"'Solar prot device - data'!B64","v":50},{"$f":"IF('Solar prot device - data'!C64<>\"\",C$6&\" + \"&'Solar prot device - data'!C64,\"\")","v":""},{"$f":"IF('Solar prot device - data'!D64<>\"\",'Solar prot device - data'!D64,\"\")","v":""},{"$f":"IF('Solar prot device - data'!E64<>\"\",'Solar prot device - data'!E64,\"\")","v":""},{"$f":"IF('Solar prot device - data'!F64<>\"\",'Solar prot device - data'!F64,\"\")","v":""},{"$f":"IF('Solar prot device - data'!G64<>\"\",'Solar prot device - data'!G64,\"\")","v":""},{"$f":"IF('Solar prot device - data'!H64<>\"\",'Solar prot device - data'!H64,\"\")","v":""},{"$f":"IF('Solar prot device - data'!I64<>\"\",'Solar prot device - data'!I64,\"\")","v":""},{"$f":"IF('Solar prot device - data'!J64<>\"\",'Solar prot device - data'!J64,\"\")","v":""},"","","","","","","","","",null,"","",""]
[null,{"$f":"'Solar prot device - data'!B65","v":51},{"$f":"IF('Solar prot device - data'!C65<>\"\",C$6&\" + \"&'Solar prot device - data'!C65,\"\")","v":""},{"$f":"IF('Solar prot device - data'!D65<>\"\",'Solar prot device - data'!D65,\"\")","v":""},{"$f":"IF('Solar prot device - data'!E65<>\"\",'Solar prot device - data'!E65,\"\")","v":""},{"$f":"IF('Solar prot device - data'!F65<>\"\",'Solar prot device - data'!F65,\"\")","v":""},{"$f":"IF('Solar prot device - data'!G65<>\"\",'Solar prot device - data'!G65,\"\")","v":""},{"$f":"IF('Solar prot device - data'!H65<>\"\",'Solar prot device - data'!H65,\"\")","v":""},{"$f":"IF('Solar prot device - data'!I65<>\"\",'Solar prot device - data'!I65,\"\")","v":""},{"$f":"IF('Solar prot device - data'!J65<>\"\",'Solar prot device - data'!J65,\"\")","v":""},"","","","","","","","","",null,"","",""]
[null,{"$f":"'Solar prot device - data'!B66","v":52},{"$f":"IF('Solar prot device - data'!C66<>\"\",C$6&\" + \"&'Solar prot device - data'!C66,\"\")","v":""},{"$f":"IF('Solar prot device - data'!D66<>\"\",'Solar prot device - data'!D66,\"\")","v":""},{"$f":"IF('Solar prot device - data'!E66<>\"\",'Solar prot device - data'!E66,\"\")","v":""},{"$f":"IF('Solar prot device - data'!F66<>\"\",'Solar prot device - data'!F66,\"\")","v":""},{"$f":"IF('Solar prot device - data'!G66<>\"\",'Solar prot device - data'!G66,\"\")","v":""},{"$f":"IF('Solar prot device - data'!H66<>\"\",'Solar prot device - data'!H66,\"\")","v":""},{"$f":"IF('Solar prot device - data'!I66<>\"\",'Solar prot device - data'!I66,\"\")","v":""},{"$f":"IF('Solar prot device - data'!J66<>\"\",'Solar prot device - data'!J66,\"\")","v":""},"","","","","","","","","",null,"","",""]
[null,{"$f":"'Solar prot device - data'!B67","v":53},{"$f":"IF('Solar prot device - data'!C67<>\"\",C$6&\" + \"&'Solar prot device - data'!C67,\"\")","v":""},{"$f":"IF('Solar prot device - data'!D67<>\"\",'Solar prot device - data'!D67,\"\")","v":""},{"$f":"IF('Solar prot device - data'!E67<>\"\",'Solar prot device - data'!E67,\"\")","v":""},{"$f":"IF('Solar prot device - data'!F67<>\"\",'Solar prot device - data'!F67,\"\")","v":""},{"$f":"IF('Solar prot device - data'!G67<>\"\",'Solar prot device - data'!G67,\"\")","v":""},{"$f":"IF('Solar prot device - data'!H67<>\"\",'Solar prot device - data'!H67,\"\")","v":""},{"$f":"IF('Solar prot device - data'!I67<>\"\",'Solar prot device - data'!I67,\"\")","v":""},{"$f":"IF('Solar prot device - data'!J67<>\"\",'Solar prot device - data'!J67,\"\")","v":""},"","","","","","","","","",null,"","",""]
[null,{"$f":"'Solar prot device - data'!B68","v":54},{"$f":"IF('Solar prot device - data'!C68<>\"\",C$6&\" + \"&'Solar prot device - data'!C68,\"\")","v":""},{"$f":"IF('Solar prot device - data'!D68<>\"\",'Solar prot device - data'!D68,\"\")","v":""},{"$f":"IF('Solar prot device - data'!E68<>\"\",'Solar prot device - data'!E68,\"\")","v":""},{"$f":"IF('Solar prot device - data'!F68<>\"\",'Solar prot device - data'!F68,\"\")","v":""},{"$f":"IF('Solar prot device - data'!G68<>\"\",'Solar prot device - data'!G68,\"\")","v":""},{"$f":"IF('Solar prot device - data'!H68<>\"\",'Solar prot device - data'!H68,\"\")","v":""},{"$f":"IF('Solar prot device - data'!I68<>\"\",'Solar prot device - data'!I68,\"\")","v":""},{"$f":"IF('Solar prot device - data'!J68<>\"\",'Solar prot device - data'!J68,\"\")","v":""},"","","","","","","","","",null,"","",""]
[null,{"$f":"'Solar prot device - data'!B69","v":55},{"$f":"IF('Solar prot device - data'!C69<>\"\",C$6&\" + \"&'Solar prot device - data'!C69,\"\")","v":""},{"$f":"IF('Solar prot device - data'!D69<>\"\",'Solar prot device - data'!D69,\"\")","v":""},{"$f":"IF('Solar prot device - data'!E69<>\"\",'Solar prot device - data'!E69,\"\")","v":""},{"$f":"IF('Solar prot device - data'!F69<>\"\",'Solar prot device - data'!F69,\"\")","v":""},{"$f":"IF('Solar prot device - data'!G69<>\"\",'Solar prot device - data'!G69,\"\")","v":""},{"$f":"IF('Solar prot device - data'!H69<>\"\",'Solar prot device - data'!H69,\"\")","v":""},{"$f":"IF('Solar prot device - data'!I69<>\"\",'Solar prot device - data'!I69,\"\")","v":""},{"$f":"IF('Solar prot device - data'!J69<>\"\",'Solar prot device - data'!J69,\"\")","v":""},"","","","","","","","","",null,"","",""]
[null,{"$f":"'Solar prot device - data'!B70","v":56},{"$f":"IF('Solar prot device - data'!C70<>\"\",C$6&\" + \"&'Solar prot device - data'!C70,\"\")","v":""},{"$f":"IF('Solar prot device - data'!D70<>\"\",'Solar prot device - data'!D70,\"\")","v":""},{"$f":"IF('Solar prot device - data'!E70<>\"\",'Solar prot device - data'!E70,\"\")","v":""},{"$f":"IF('Solar prot device - data'!F70<>\"\",'Solar prot device - data'!F70,\"\")","v":""},{"$f":"IF('Solar prot device - data'!G70<>\"\",'Solar prot device - data'!G70,\"\")","v":""},{"$f":"IF('Solar prot device - data'!H70<>\"\",'Solar prot device - data'!H70,\"\")","v":""},{"$f":"IF('Solar prot device - data'!I70<>\"\",'Solar prot device - data'!I70,\"\")","v":""},{"$f":"IF('Solar prot device - data'!J70<>\"\",'Solar prot device - data'!J70,\"\")","v":""},"","","","","","","","","",null,"","",""]
[null,{"$f":"'Solar prot device - data'!B71","v":57},{"$f":"IF('Solar prot device - data'!C71<>\"\",C$6&\" + \"&'Solar prot device - data'!C71,\"\")","v":""},{"$f":"IF('Solar prot device - data'!D71<>\"\",'Solar prot device - data'!D71,\"\")","v":""},{"$f":"IF('Solar prot device - data'!E71<>\"\",'Solar prot device - data'!E71,\"\")","v":""},{"$f":"IF('Solar prot device - data'!F71<>\"\",'Solar prot device - data'!F71,\"\")","v":""},{"$f":"IF('Solar prot device - data'!G71<>\"\",'Solar prot device - data'!G71,\"\")","v":""},{"$f":"IF('Solar prot device - data'!H71<>\"\",'Solar prot device - data'!H71,\"\")","v":""},{"$f":"IF('Solar prot device - data'!I71<>\"\",'Solar prot device - data'!I71,\"\")","v":""},{"$f":"IF('Solar prot device - data'!J71<>\"\",'Solar prot device - data'!J71,\"\")","v":""},"","","","","","","","","",null,"","",""]
[null,{"$f":"'Solar prot device - data'!B72","v":58},{"$f":"IF('Solar prot device - data'!C72<>\"\",C$6&\" + \"&'Solar prot device - data'!C72,\"\")","v":""},{"$f":"IF('Solar prot device - data'!D72<>\"\",'Solar prot device - data'!D72,\"\")","v":""},{"$f":"IF('Solar prot device - data'!E72<>\"\",'Solar prot device - data'!E72,\"\")","v":""},{"$f":"IF('Solar prot device - data'!F72<>\"\",'Solar prot device - data'!F72,\"\")","v":""},{"$f":"IF('Solar prot device - data'!G72<>\"\",'Solar prot device - data'!G72,\"\")","v":""},{"$f":"IF('Solar prot device - data'!H72<>\"\",'Solar prot device - data'!H72,\"\")","v":""},{"$f":"IF('Solar prot device - data'!I72<>\"\",'Solar prot device - data'!I72,\"\")","v":""},{"$f":"IF('Solar prot device - data'!J72<>\"\",'Solar prot device - data'!J72,\"\")","v":""},"","","","","","","","","",null,"","",""]
[null,{"$f":"'Solar prot device - data'!B73","v":59},{"$f":"IF('Solar prot device - data'!C73<>\"\",C$6&\" + \"&'Solar prot device - data'!C73,\"\")","v":""},{"$f":"IF('Solar prot device - data'!D73<>\"\",'Solar prot device - data'!D73,\"\")","v":""},{"$f":"IF('Solar prot device - data'!E73<>\"\",'Solar prot device - data'!E73,\"\")","v":""},{"$f":"IF('Solar prot device - data'!F73<>\"\",'Solar prot device - data'!F73,\"\")","v":""},{"$f":"IF('Solar prot device - data'!G73<>\"\",'Solar prot device - data'!G73,\"\")","v":""},{"$f":"IF('Solar prot device - data'!H73<>\"\",'Solar prot device - data'!H73,\"\")","v":""},{"$f":"IF('Solar prot device - data'!I73<>\"\",'Solar prot device - data'!I73,\"\")","v":""},{"$f":"IF('Solar prot device - data'!J73<>\"\",'Solar prot device - data'!J73,\"\")","v":""},"","","","","","","","","",null,"","",""]
[null,{"$f":"'Solar prot device - data'!B74","v":60},{"$f":"IF('Solar prot device - data'!C74<>\"\",C$6&\" + \"&'Solar prot device - data'!C74,\"\")","v":""},{"$f":"IF('Solar prot device - data'!D74<>\"\",'Solar prot device - data'!D74,\"\")","v":""},{"$f":"IF('Solar prot device - data'!E74<>\"\",'Solar prot device - data'!E74,\"\")","v":""},{"$f":"IF('Solar prot device - data'!F74<>\"\",'Solar prot device - data'!F74,\"\")","v":""},{"$f":"IF('Solar prot device - data'!G74<>\"\",'Solar prot device - data'!G74,\"\")","v":""},{"$f":"IF('Solar prot device - data'!H74<>\"\",'Solar prot device - data'!H74,\"\")","v":""},{"$f":"IF('Solar prot device - data'!I74<>\"\",'Solar prot device - data'!I74,\"\")","v":""},{"$f":"IF('Solar prot device - data'!J74<>\"\",'Solar prot device - data'!J74,\"\")","v":""},"","","","","","","","","",null,"","",""]
[null,{"$f":"'Solar prot device - data'!B75","v":61},{"$f":"IF('Solar prot device - data'!C75<>\"\",C$6&\" + \"&'Solar prot device - data'!C75,\"\")","v":""},{"$f":"IF('Solar prot device - data'!D75<>\"\",'Solar prot device - data'!D75,\"\")","v":""},{"$f":"IF('Solar prot device - data'!E75<>\"\",'Solar prot device - data'!E75,\"\")","v":""},{"$f":"IF('Solar prot device - data'!F75<>\"\",'Solar prot device - data'!F75,\"\")","v":""},{"$f":"IF('Solar prot device - data'!G75<>\"\",'Solar prot device - data'!G75,\"\")","v":""},{"$f":"IF('Solar prot device - data'!H75<>\"\",'Solar prot device - data'!H75,\"\")","v":""},{"$f":"IF('Solar prot device - data'!I75<>\"\",'Solar prot device - data'!I75,\"\")","v":""},{"$f":"IF('Solar prot device - data'!J75<>\"\",'Solar prot device - data'!J75,\"\")","v":""},"","","","","","","","","",null,"","",""]
[null,{"$f":"'Solar prot device - data'!B76","v":62},{"$f":"IF('Solar prot device - data'!C76<>\"\",C$6&\" + \"&'Solar prot device - data'!C76,\"\")","v":""},{"$f":"IF('Solar prot device - data'!D76<>\"\",'Solar prot device - data'!D76,\"\")","v":""},{"$f":"IF('Solar prot device - data'!E76<>\"\",'Solar prot device - data'!E76,\"\")","v":""},{"$f":"IF('Solar prot device - data'!F76<>\"\",'Solar prot device - data'!F76,\"\")","v":""},{"$f":"IF('Solar prot device - data'!G76<>\"\",'Solar prot device - data'!G76,\"\")","v":""},{"$f":"IF('Solar prot device - data'!H76<>\"\",'Solar prot device - data'!H76,\"\")","v":""},{"$f":"IF('Solar prot device - data'!I76<>\"\",'Solar prot device - data'!I76,\"\")","v":""},{"$f":"IF('Solar prot device - data'!J76<>\"\",'Solar prot device - data'!J76,\"\")","v":""},"","","","","","","","","",null,"","",""]
[null,{"$f":"'Solar prot device - data'!B77","v":63},{"$f":"IF('Solar prot device - data'!C77<>\"\",C$6&\" + \"&'Solar prot device - data'!C77,\"\")","v":""},{"$f":"IF('Solar prot device - data'!D77<>\"\",'Solar prot device - data'!D77,\"\")","v":""},{"$f":"IF('Solar prot device - data'!E77<>\"\",'Solar prot device - data'!E77,\"\")","v":""},{"$f":"IF('Solar prot device - data'!F77<>\"\",'Solar prot device - data'!F77,\"\")","v":""},{"$f":"IF('Solar prot device - data'!G77<>\"\",'Solar prot device - data'!G77,\"\")","v":""},{"$f":"IF('Solar prot device - data'!H77<>\"\",'Solar prot device - data'!H77,\"\")","v":""},{"$f":"IF('Solar prot device - data'!I77<>\"\",'Solar prot device - data'!I77,\"\")","v":""},{"$f":"IF('Solar prot device - data'!J77<>\"\",'Solar prot device - data'!J77,\"\")","v":""},"","","","","","","","","",null,"","",""]
[null,{"$f":"'Solar prot device - data'!B78","v":64},{"$f":"IF('Solar prot device - data'!C78<>\"\",C$6&\" + \"&'Solar prot device - data'!C78,\"\")","v":""},{"$f":"IF('Solar prot device - data'!D78<>\"\",'Solar prot device - data'!D78,\"\")","v":""},{"$f":"IF('Solar prot device - data'!E78<>\"\",'Solar prot device - data'!E78,\"\")","v":""},{"$f":"IF('Solar prot device - data'!F78<>\"\",'Solar prot device - data'!F78,\"\")","v":""},{"$f":"IF('Solar prot device - data'!G78<>\"\",'Solar prot device - data'!G78,\"\")","v":""},{"$f":"IF('Solar prot device - data'!H78<>\"\",'Solar prot device - data'!H78,\"\")","v":""},{"$f":"IF('Solar prot device - data'!I78<>\"\",'Solar prot device - data'!I78,\"\")","v":""},{"$f":"IF('Solar prot device - data'!J78<>\"\",'Solar prot device - data'!J78,\"\")","v":""},"","","","","","","","","",null,"","",""]
[null,{"$f":"'Solar prot device - data'!B79","v":65},{"$f":"IF('Solar prot device - data'!C79<>\"\",C$6&\" + \"&'Solar prot device - data'!C79,\"\")","v":""},{"$f":"IF('Solar prot device - data'!D79<>\"\",'Solar prot device - data'!D79,\"\")","v":""},{"$f":"IF('Solar prot device - data'!E79<>\"\",'Solar prot device - data'!E79,\"\")","v":""},{"$f":"IF('Solar prot device - data'!F79<>\"\",'Solar prot device - data'!F79,\"\")","v":""},{"$f":"IF('Solar prot device - data'!G79<>\"\",'Solar prot device - data'!G79,\"\")","v":""},{"$f":"IF('Solar prot device - data'!H79<>\"\",'Solar prot device - data'!H79,\"\")","v":""},{"$f":"IF('Solar prot device - data'!I79<>\"\",'Solar prot device - data'!I79,\"\")","v":""},{"$f":"IF('Solar prot device - data'!J79<>\"\",'Solar prot device - data'!J79,\"\")","v":""},{"$f":"IF(AND(D79<>\"\",E79<>\"\",$D$6<>\"\",$E$6<>\"\"),D79*$E$6+G79*$AB$6/$AB$3+D79*(1-$E$6)*$AB$6/$AB$2,\"\")","v":""},{"$f":"IF(AND(D79<>\"\",E79<>\"\",$D$6<>\"\",$E$6<>\"\"),$E$6*(1-$E$6*E79-G79*$AB$7/$AB$4),\"\")","v":""},{"$f":"IF(AND(D79<>\"\",E79<>\"\",$D$6<>\"\",$E$6<>\"\"),$E$6*D79+$E$6*(G79+(1-$E$6)*E79)*$AB$8/$AB$5,\"\")","v":""},{"$f":"IF(AND(D79<>\"\",F79<>\"\",$F$6<>\"\",$G$6<>\"\"),$F$6*D79/(1-$G$6*F79),\"\")","v":""},{"$f":"IF(AND(D79<>\"\",E79<>\"\",$F$6<>\"\",$H$6<>\"\"),$F$6*D79/(1-$H$6*E79),\"\")","v":""},"","",{"$f":"IF(AND(H79<>\"\",J79<>\"\",$I$6<>\"\",$J$6<>\"\"),$I$6*H79/(1-$J$6*J79),\"\")","v":""},{"$f":"IF(AND(H79<>\"\",I79<>\"\",$I$6<>\"\",$K$6<>\"\"),$I$6*H79/(1-$K$6*I79),\"\")","v":""},null,{"$f":"IF(AND(K79<>\"\",$E$6<>\"\"),K79/$E$6,\"\")","v":""},{"$f":"IF(AND(L79<>\"\",$E$6<>\"\"),L79/$E$6,\"\")","v":""},{"$f":"IF(AND(M79<>\"\",$E$6<>\"\"),M79/$E$6,\"\")","v":""}]
[null,{"$f":"'Solar prot device - data'!B80","v":66},{"$f":"IF('Solar prot device - data'!C80<>\"\",C$6&\" + \"&'Solar prot device - data'!C80,\"\")","v":""},{"$f":"IF('Solar prot device - data'!D80<>\"\",'Solar prot device - data'!D80,\"\")","v":""},{"$f":"IF('Solar prot device - data'!E80<>\"\",'Solar prot device - data'!E80,\"\")","v":""},{"$f":"IF('Solar prot device - data'!F80<>\"\",'Solar prot device - data'!F80,\"\")","v":""},{"$f":"IF('Solar prot device - data'!G80<>\"\",'Solar prot device - data'!G80,\"\")","v":""},{"$f":"IF('Solar prot device - data'!H80<>\"\",'Solar prot device - data'!H80,\"\")","v":""},{"$f":"IF('Solar prot device - data'!I80<>\"\",'Solar prot device - data'!I80,\"\")","v":""},{"$f":"IF('Solar prot device - data'!J80<>\"\",'Solar prot device - data'!J80,\"\")","v":""},"","","","","",{"$f":"IF(AND(K80<>\"\", N80<>\"\"),K80-N80,\"\")","v":""},{"$f":"IF(AND(L80<>\"\", O80<>\"\"),L80-O80,\"\")","v":""},"","",null,"","",""]
[null,{"$f":"'Solar prot device - data'!B81","v":67},{"$f":"IF('Solar prot device - data'!C81<>\"\",C$6&\" + \"&'Solar prot device - data'!C81,\"\")","v":""},{"$f":"IF('Solar prot device - data'!D81<>\"\",'Solar prot device - data'!D81,\"\")","v":""},{"$f":"IF('Solar prot device - data'!E81<>\"\",'Solar prot device - data'!E81,\"\")","v":""},{"$f":"IF('Solar prot device - data'!F81<>\"\",'Solar prot device - data'!F81,\"\")","v":""},{"$f":"IF('Solar prot device - data'!G81<>\"\",'Solar prot device - data'!G81,\"\")","v":""},{"$f":"IF('Solar prot device - data'!H81<>\"\",'Solar prot device - data'!H81,\"\")","v":""},{"$f":"IF('Solar prot device - data'!I81<>\"\",'Solar prot device - data'!I81,\"\")","v":""},{"$f":"IF('Solar prot device - data'!J81<>\"\",'Solar prot device - data'!J81,\"\")","v":""},"","","","","","","","","",null,"","",""]
[null,{"$f":"'Solar prot device - data'!B82","v":68},{"$f":"IF('Solar prot device - data'!C82<>\"\",C$6&\" + \"&'Solar prot device - data'!C82,\"\")","v":""},{"$f":"IF('Solar prot device - data'!D82<>\"\",'Solar prot device - data'!D82,\"\")","v":""},{"$f":"IF('Solar prot device - data'!E82<>\"\",'Solar prot device - data'!E82,\"\")","v":""},{"$f":"IF('Solar prot device - data'!F82<>\"\",'Solar prot device - data'!F82,\"\")","v":""},{"$f":"IF('Solar prot device - data'!G82<>\"\",'Solar prot device - data'!G82,\"\")","v":""},{"$f":"IF('Solar prot device - data'!H82<>\"\",'Solar prot device - data'!H82,\"\")","v":""},{"$f":"IF('Solar prot device - data'!I82<>\"\",'Solar prot device - data'!I82,\"\")","v":""},{"$f":"IF('Solar prot device - data'!J82<>\"\",'Solar prot device - data'!J82,\"\")","v":""},"","","","","","","","","",null,"","",""]
[null,{"$f":"'Solar prot device - data'!B83","v":69},{"$f":"IF('Solar prot device - data'!C83<>\"\",C$6&\" + \"&'Solar prot device - data'!C83,\"\")","v":""},{"$f":"IF('Solar prot device - data'!D83<>\"\",'Solar prot device - data'!D83,\"\")","v":""},{"$f":"IF('Solar prot device - data'!E83<>\"\",'Solar prot device - data'!E83,\"\")","v":""},{"$f":"IF('Solar prot device - data'!F83<>\"\",'Solar prot device - data'!F83,\"\")","v":""},{"$f":"IF('Solar prot device - data'!G83<>\"\",'Solar prot device - data'!G83,\"\")","v":""},{"$f":"IF('Solar prot device - data'!H83<>\"\",'Solar prot device - data'!H83,\"\")","v":""},{"$f":"IF('Solar prot device - data'!I83<>\"\",'Solar prot device - data'!I83,\"\")","v":""},{"$f":"IF('Solar prot device - data'!J83<>\"\",'Solar prot device - data'!J83,\"\")","v":""},"","","","","","","","","",null,"","",""]
[null,{"$f":"'Solar prot device - data'!B84","v":70},{"$f":"IF('Solar prot device - data'!C84<>\"\",C$6&\" + \"&'Solar prot device - data'!C84,\"\")","v":""},{"$f":"IF('Solar prot device - data'!D84<>\"\",'Solar prot device - data'!D84,\"\")","v":""},{"$f":"IF('Solar prot device - data'!E84<>\"\",'Solar prot device - data'!E84,\"\")","v":""},{"$f":"IF('Solar prot device - data'!F84<>\"\",'Solar prot device - data'!F84,\"\")","v":""},{"$f":"IF('Solar prot device - data'!G84<>\"\",'Solar prot device - data'!G84,\"\")","v":""},{"$f":"IF('Solar prot device - data'!H84<>\"\",'Solar prot device - data'!H84,\"\")","v":""},{"$f":"IF('Solar prot device - data'!I84<>\"\",'Solar prot device - data'!I84,\"\")","v":""},{"$f":"IF('Solar prot device - data'!J84<>\"\",'Solar prot device - data'!J84,\"\")","v":""},"","","","","","","","","",null,"","",""]
[null,{"$f":"'Solar prot device - data'!B85","v":71},{"$f":"IF('Solar prot device - data'!C85<>\"\",C$6&\" + \"&'Solar prot device - data'!C85,\"\")","v":""},{"$f":"IF('Solar prot device - data'!D85<>\"\",'Solar prot device - data'!D85,\"\")","v":""},{"$f":"IF('Solar prot device - data'!E85<>\"\",'Solar prot device - data'!E85,\"\")","v":""},{"$f":"IF('Solar prot device - data'!F85<>\"\",'Solar prot device - data'!F85,\"\")","v":""},{"$f":"IF('Solar prot device - data'!G85<>\"\",'Solar prot device - data'!G85,\"\")","v":""},{"$f":"IF('Solar prot device - data'!H85<>\"\",'Solar prot device - data'!H85,\"\")","v":""},{"$f":"IF('Solar prot device - data'!I85<>\"\",'Solar prot device - data'!I85,\"\")","v":""},{"$f":"IF('Solar prot device - data'!J85<>\"\",'Solar prot device - data'!J85,\"\")","v":""},"","","","","","","","","",null,"","",""]
[null,{"$f":"'Solar prot device - data'!B86","v":72},{"$f":"IF('Solar prot device - data'!C86<>\"\",C$6&\" + \"&'Solar prot device - data'!C86,\"\")","v":""},{"$f":"IF('Solar prot device - data'!D86<>\"\",'Solar prot device - data'!D86,\"\")","v":""},{"$f":"IF('Solar prot device - data'!E86<>\"\",'Solar prot device - data'!E86,\"\")","v":""},{"$f":"IF('Solar prot device - data'!F86<>\"\",'Solar prot device - data'!F86,\"\")","v":""},{"$f":"IF('Solar prot device - data'!G86<>\"\",'Solar prot device - data'!G86,\"\")","v":""},{"$f":"IF('Solar prot device - data'!H86<>\"\",'Solar prot device - data'!H86,\"\")","v":""},{"$f":"IF('Solar prot device - data'!I86<>\"\",'Solar prot device - data'!I86,\"\")","v":""},{"$f":"IF('Solar prot device - data'!J86<>\"\",'Solar prot device - data'!J86,\"\")","v":""},"","","","","","","","","",null,"","",""]
[null,{"$f":"'Solar prot device - data'!B87","v":73},{"$f":"IF('Solar prot device - data'!C87<>\"\",C$6&\" + \"&'Solar prot device - data'!C87,\"\")","v":""},{"$f":"IF('Solar prot device - data'!D87<>\"\",'Solar prot device - data'!D87,\"\")","v":""},{"$f":"IF('Solar prot device - data'!E87<>\"\",'Solar prot device - data'!E87,\"\")","v":""},{"$f":"IF('Solar prot device - data'!F87<>\"\",'Solar prot device - data'!F87,\"\")","v":""},{"$f":"IF('Solar prot device - data'!G87<>\"\",'Solar prot device - data'!G87,\"\")","v":""},{"$f":"IF('Solar prot device - data'!H87<>\"\",'Solar prot device - data'!H87,\"\")","v":""},{"$f":"IF('Solar prot device - data'!I87<>\"\",'Solar prot device - data'!I87,\"\")","v":""},{"$f":"IF('Solar prot device - data'!J87<>\"\",'Solar prot device - data'!J87,\"\")","v":""},"","","","","","","","","",null,"","",""]
[null,{"$f":"'Solar prot device - data'!B88","v":74},{"$f":"IF('Solar prot device - data'!C88<>\"\",C$6&\" + \"&'Solar prot device - data'!C88,\"\")","v":""},{"$f":"IF('Solar prot device - data'!D88<>\"\",'Solar prot device - data'!D88,\"\")","v":""},{"$f":"IF('Solar prot device - data'!E88<>\"\",'Solar prot device - data'!E88,\"\")","v":""},{"$f":"IF('Solar prot device - data'!F88<>\"\",'Solar prot device - data'!F88,\"\")","v":""},{"$f":"IF('Solar prot device - data'!G88<>\"\",'Solar prot device - data'!G88,\"\")","v":""},{"$f":"IF('Solar prot device - data'!H88<>\"\",'Solar prot device - data'!H88,\"\")","v":""},{"$f":"IF('Solar prot device - data'!I88<>\"\",'Solar prot device - data'!I88,\"\")","v":""},{"$f":"IF('Solar prot device - data'!J88<>\"\",'Solar prot device - data'!J88,\"\")","v":""},"","","","","","","","","",null,"","",""]
[null,{"$f":"'Solar prot device - data'!B89","v":75},{"$f":"IF('Solar prot device - data'!C89<>\"\",C$6&\" + \"&'Solar prot device - data'!C89,\"\")","v":""},{"$f":"IF('Solar prot device - data'!D89<>\"\",'Solar prot device - data'!D89,\"\")","v":""},{"$f":"IF('Solar prot device - data'!E89<>\"\",'Solar prot device - data'!E89,\"\")","v":""},{"$f":"IF('Solar prot device - data'!F89<>\"\",'Solar prot device - data'!F89,\"\")","v":""},{"$f":"IF('Solar prot device - data'!G89<>\"\",'Solar prot device - data'!G89,\"\")","v":""},{"$f":"IF('Solar prot device - data'!H89<>\"\",'Solar prot device - data'!H89,\"\")","v":""},{"$f":"IF('Solar prot device - data'!I89<>\"\",'Solar prot device - data'!I89,\"\")","v":""},{"$f":"IF('Solar prot device - data'!J89<>\"\",'Solar prot device - data'!J89,\"\")","v":""},"","","","","","","","","",null,"","",""]
[null,{"$f":"'Solar prot device - data'!B90","v":76},{"$f":"IF('Solar prot device - data'!C90<>\"\",C$6&\" + \"&'Solar prot device - data'!C90,\"\")","v":""},{"$f":"IF('Solar prot device - data'!D90<>\"\",'Solar prot device - data'!D90,\"\")","v":""},{"$f":"IF('Solar prot device - data'!E90<>\"\",'Solar prot device - data'!E90,\"\")","v":""},{"$f":"IF('Solar prot device - data'!F90<>\"\",'Solar prot device - data'!F90,\"\")","v":""},{"$f":"IF('Solar prot device - data'!G90<>\"\",'Solar prot device - data'!G90,\"\")","v":""},{"$f":"IF('Solar prot device - data'!H90<>\"\",'Solar prot device - data'!H90,\"\")","v":""},{"$f":"IF('Solar prot device - data'!I90<>\"\",'Solar prot device - data'!I90,\"\")","v":""},{"$f":"IF('Solar prot device - data'!J90<>\"\",'Solar prot device - data'!J90,\"\")","v":""},"","","","","","","","","",null,"","",""]
[null,{"$f":"'Solar prot device - data'!B91","v":77},{"$f":"IF('Solar prot device - data'!C91<>\"\",C$6&\" + \"&'Solar prot device - data'!C91,\"\")","v":""},{"$f":"IF('Solar prot device - data'!D91<>\"\",'Solar prot device - data'!D91,\"\")","v":""},{"$f":"IF('Solar prot device - data'!E91<>\"\",'Solar prot device - data'!E91,\"\")","v":""},{"$f":"IF('Solar prot device - data'!F91<>\"\",'Solar prot device - data'!F91,\"\")","v":""},{"$f":"IF('Solar prot device - data'!G91<>\"\",'Solar prot device - data'!G91,\"\")","v":""},{"$f":"IF('Solar prot device - data'!H91<>\"\",'Solar prot device - data'!H91,\"\")","v":""},{"$f":"IF('Solar prot device - data'!I91<>\"\",'Solar prot device - data'!I91,\"\")","v":""},{"$f":"IF('Solar prot device - data'!J91<>\"\",'Solar prot device - data'!J91,\"\")","v":""},"","","","","","","","","",null,"","",""]
[null,{"$f":"'Solar prot device - data'!B92","v":78},{"$f":"IF('Solar prot device - data'!C92<>\"\",C$6&\" + \"&'Solar prot device - data'!C92,\"\")","v":""},{"$f":"IF('Solar prot device - data'!D92<>\"\",'Solar prot device - data'!D92,\"\")","v":""},{"$f":"IF('Solar prot device - data'!E92<>\"\",'Solar prot device - data'!E92,\"\")","v":""},{"$f":"IF('Solar prot device - data'!F92<>\"\",'Solar prot device - data'!F92,\"\")","v":""},{"$f":"IF('Solar prot device - data'!G92<>\"\",'Solar prot device - data'!G92,\"\")","v":""},{"$f":"IF('Solar prot device - data'!H92<>\"\",'Solar prot device - data'!H92,\"\")","v":""},{"$f":"IF('Solar prot device - data'!I92<>\"\",'Solar prot device - data'!I92,\"\")","v":""},{"$f":"IF('Solar prot device - data'!J92<>\"\",'Solar prot device - data'!J92,\"\")","v":""},"","","","","","","","","",null,"","",""]
[null,{"$f":"'Solar prot device - data'!B93","v":79},{"$f":"IF('Solar prot device - data'!C93<>\"\",C$6&\" + \"&'Solar prot device - data'!C93,\"\")","v":""},{"$f":"IF('Solar prot device - data'!D93<>\"\",'Solar prot device - data'!D93,\"\")","v":""},{"$f":"IF('Solar prot device - data'!E93<>\"\",'Solar prot device - data'!E93,\"\")","v":""},{"$f":"IF('Solar prot device - data'!F93<>\"\",'Solar prot device - data'!F93,\"\")","v":""},{"$f":"IF('Solar prot device - data'!G93<>\"\",'Solar prot device - data'!G93,\"\")","v":""},{"$f":"IF('Solar prot device - data'!H93<>\"\",'Solar prot device - data'!H93,\"\")","v":""},{"$f":"IF('Solar prot device - data'!I93<>\"\",'Solar prot device - data'!I93,\"\")","v":""},{"$f":"IF('Solar prot device - data'!J93<>\"\",'Solar prot device - data'!J93,\"\")","v":""},"","","","","","","","","",null,"","",""]
[null,{"$f":"'Solar prot device - data'!B94","v":80},{"$f":"IF('Solar prot device - data'!C94<>\"\",C$6&\" + \"&'Solar prot device - data'!C94,\"\")","v":""},{"$f":"IF('Solar prot device - data'!D94<>\"\",'Solar prot device - data'!D94,\"\")","v":""},{"$f":"IF('Solar prot device - data'!E94<>\"\",'Solar prot device - data'!E94,\"\")","v":""},{"$f":"IF('Solar prot device - data'!F94<>\"\",'Solar prot device - data'!F94,\"\")","v":""},{"$f":"IF('Solar prot device - data'!G94<>\"\",'Solar prot device - data'!G94,\"\")","v":""},{"$f":"IF('Solar prot device - data'!H94<>\"\",'Solar prot device - data'!H94,\"\")","v":""},{"$f":"IF('Solar prot device - data'!I94<>\"\",'Solar prot device - data'!I94,\"\")","v":""},{"$f":"IF('Solar prot device - data'!J94<>\"\",'Solar prot device - data'!J94,\"\")","v":""},"","","","","","","","","",null,"","",""]
[null,{"$f":"'Solar prot device - data'!B95","v":81},{"$f":"IF('Solar prot device - data'!C95<>\"\",C$6&\" + \"&'Solar prot device - data'!C95,\"\")","v":""},{"$f":"IF('Solar prot device - data'!D95<>\"\",'Solar prot device - data'!D95,\"\")","v":""},{"$f":"IF('Solar prot device - data'!E95<>\"\",'Solar prot device - data'!E95,\"\")","v":""},{"$f":"IF('Solar prot device - data'!F95<>\"\",'Solar prot device - data'!F95,\"\")","v":""},{"$f":"IF('Solar prot device - data'!G95<>\"\",'Solar prot device - data'!G95,\"\")","v":""},{"$f":"IF('Solar prot device - data'!H95<>\"\",'Solar prot device - data'!H95,\"\")","v":""},{"$f":"IF('Solar prot device - data'!I95<>\"\",'Solar prot device - data'!I95,\"\")","v":""},{"$f":"IF('Solar prot device - data'!J95<>\"\",'Solar prot device - data'!J95,\"\")","v":""},"","","","","","","","","",null,"","",""]
[null,{"$f":"'Solar prot device - data'!B96","v":82},{"$f":"IF('Solar prot device - data'!C96<>\"\",C$6&\" + \"&'Solar prot device - data'!C96,\"\")","v":""},{"$f":"IF('Solar prot device - data'!D96<>\"\",'Solar prot device - data'!D96,\"\")","v":""},{"$f":"IF('Solar prot device - data'!E96<>\"\",'Solar prot device - data'!E96,\"\")","v":""},{"$f":"IF('Solar prot device - data'!F96<>\"\",'Solar prot device - data'!F96,\"\")","v":""},{"$f":"IF('Solar prot device - data'!G96<>\"\",'Solar prot device - data'!G96,\"\")","v":""},{"$f":"IF('Solar prot device - data'!H96<>\"\",'Solar prot device - data'!H96,\"\")","v":""},{"$f":"IF('Solar prot device - data'!I96<>\"\",'Solar prot device - data'!I96,\"\")","v":""},{"$f":"IF('Solar prot device - data'!J96<>\"\",'Solar prot device - data'!J96,\"\")","v":""},"","","","","","","","","",null,"","",""]
[null,{"$f":"'Solar prot device - data'!B97","v":83},{"$f":"IF('Solar prot device - data'!C97<>\"\",C$6&\" + \"&'Solar prot device - data'!C97,\"\")","v":""},{"$f":"IF('Solar prot device - data'!D97<>\"\",'Solar prot device - data'!D97,\"\")","v":""},{"$f":"IF('Solar prot device - data'!E97<>\"\",'Solar prot device - data'!E97,\"\")","v":""},{"$f":"IF('Solar prot device - data'!F97<>\"\",'Solar prot device - data'!F97,\"\")","v":""},{"$f":"IF('Solar prot device - data'!G97<>\"\",'Solar prot device - data'!G97,\"\")","v":""},{"$f":"IF('Solar prot device - data'!H97<>\"\",'Solar prot device - data'!H97,\"\")","v":""},{"$f":"IF('Solar prot device - data'!I97<>\"\",'Solar prot device - data'!I97,\"\")","v":""},{"$f":"IF('Solar prot device - data'!J97<>\"\",'Solar prot device - data'!J97,\"\")","v":""},"","","","","","","","","",null,"","",""]
[null,{"$f":"'Solar prot device - data'!B98","v":84},{"$f":"IF('Solar prot device - data'!C98<>\"\",C$6&\" + \"&'Solar prot device - data'!C98,\"\")","v":""},{"$f":"IF('Solar prot device - data'!D98<>\"\",'Solar prot device - data'!D98,\"\")","v":""},{"$f":"IF('Solar prot device - data'!E98<>\"\",'Solar prot device - data'!E98,\"\")","v":""},{"$f":"IF('Solar prot device - data'!F98<>\"\",'Solar prot device - data'!F98,\"\")","v":""},{"$f":"IF('Solar prot device - data'!G98<>\"\",'Solar prot device - data'!G98,\"\")","v":""},{"$f":"IF('Solar prot device - data'!H98<>\"\",'Solar prot device - data'!H98,\"\")","v":""},{"$f":"IF('Solar prot device - data'!I98<>\"\",'Solar prot device - data'!I98,\"\")","v":""},{"$f":"IF('Solar prot device - data'!J98<>\"\",'Solar prot device - data'!J98,\"\")","v":""},"","","","","","","","","",null,"","",""]
[null,{"$f":"'Solar prot device - data'!B99","v":85},{"$f":"IF('Solar prot device - data'!C99<>\"\",C$6&\" + \"&'Solar prot device - data'!C99,\"\")","v":""},{"$f":"IF('Solar prot device - data'!D99<>\"\",'Solar prot device - data'!D99,\"\")","v":""},{"$f":"IF('Solar prot device - data'!E99<>\"\",'Solar prot device - data'!E99,\"\")","v":""},{"$f":"IF('Solar prot device - data'!F99<>\"\",'Solar prot device - data'!F99,\"\")","v":""},{"$f":"IF('Solar prot device - data'!G99<>\"\",'Solar prot device - data'!G99,\"\")","v":""},{"$f":"IF('Solar prot device - data'!H99<>\"\",'Solar prot device - data'!H99,\"\")","v":""},{"$f":"IF('Solar prot device - data'!I99<>\"\",'Solar prot device - data'!I99,\"\")","v":""},{"$f":"IF('Solar prot device - data'!J99<>\"\",'Solar prot device - data'!J99,\"\")","v":""},"","","","","","","","","",null,"","",""]
[null,{"$f":"'Solar prot device - data'!B100","v":86},{"$f":"IF('Solar prot device - data'!C100<>\"\",C$6&\" + \"&'Solar prot device - data'!C100,\"\")","v":""},{"$f":"IF('Solar prot device - data'!D100<>\"\",'Solar prot device - data'!D100,\"\")","v":""},{"$f":"IF('Solar prot device - data'!E100<>\"\",'Solar prot device - data'!E100,\"\")","v":""},{"$f":"IF('Solar prot device - data'!F100<>\"\",'Solar prot device - data'!F100,\"\")","v":""},{"$f":"IF('Solar prot device - data'!G100<>\"\",'Solar prot device - data'!G100,\"\")","v":""},{"$f":"IF('Solar prot device - data'!H100<>\"\",'Solar prot device - data'!H100,\"\")","v":""},{"$f":"IF('Solar prot device - data'!I100<>\"\",'Solar prot device - data'!I100,\"\")","v":""},{"$f":"IF('Solar prot device - data'!J100<>\"\",'Solar prot device - data'!J100,\"\")","v":""},"","","","","","","","","",null,"","",""]
[null,{"$f":"'Solar prot device - data'!B101","v":87},{"$f":"IF('Solar prot device - data'!C101<>\"\",C$6&\" + \"&'Solar prot device - data'!C101,\"\")","v":""},{"$f":"IF('Solar prot device - data'!D101<>\"\",'Solar prot device - data'!D101,\"\")","v":""},{"$f":"IF('Solar prot device - data'!E101<>\"\",'Solar prot device - data'!E101,\"\")","v":""},{"$f":"IF('Solar prot device - data'!F101<>\"\",'Solar prot device - data'!F101,\"\")","v":""},{"$f":"IF('Solar prot device - data'!G101<>\"\",'Solar prot device - data'!G101,\"\")","v":""},{"$f":"IF('Solar prot device - data'!H101<>\"\",'Solar prot device - data'!H101,\"\")","v":""},{"$f":"IF('Solar prot device - data'!I101<>\"\",'Solar prot device - data'!I101,\"\")","v":""},{"$f":"IF('Solar prot device - data'!J101<>\"\",'Solar prot device - data'!J101,\"\")","v":""},"","","","","","","","","",null,"","",""]
[null,{"$f":"'Solar prot device - data'!B102","v":88},{"$f":"IF('Solar prot device - data'!C102<>\"\",C$6&\" + \"&'Solar prot device - data'!C102,\"\")","v":""},{"$f":"IF('Solar prot device - data'!D102<>\"\",'Solar prot device - data'!D102,\"\")","v":""},{"$f":"IF('Solar prot device - data'!E102<>\"\",'Solar prot device - data'!E102,\"\")","v":""},{"$f":"IF('Solar prot device - data'!F102<>\"\",'Solar prot device - data'!F102,\"\")","v":""},{"$f":"IF('Solar prot device - data'!G102<>\"\",'Solar prot device - data'!G102,\"\")","v":""},{"$f":"IF('Solar prot device - data'!H102<>\"\",'Solar prot device - data'!H102,\"\")","v":""},{"$f":"IF('Solar prot device - data'!I102<>\"\",'Solar prot device - data'!I102,\"\")","v":""},{"$f":"IF('Solar prot device - data'!J102<>\"\",'Solar prot device - data'!J102,\"\")","v":""},"","","","","","","","","",null,"","",""]
[null,{"$f":"'Solar prot device - data'!B103","v":89},{"$f":"IF('Solar prot device - data'!C103<>\"\",C$6&\" + \"&'Solar prot device - data'!C103,\"\")","v":""},{"$f":"IF('Solar prot device - data'!D103<>\"\",'Solar prot device - data'!D103,\"\")","v":""},{"$f":"IF('Solar prot device - data'!E103<>\"\",'Solar prot device - data'!E103,\"\")","v":""},{"$f":"IF('Solar prot device - data'!F103<>\"\",'Solar prot device - data'!F103,\"\")","v":""},{"$f":"IF('Solar prot device - data'!G103<>\"\",'Solar prot device - data'!G103,\"\")","v":""},{"$f":"IF('Solar prot device - data'!H103<>\"\",'Solar prot device - data'!H103,\"\")","v":""},{"$f":"IF('Solar prot device - data'!I103<>\"\",'Solar prot device - data'!I103,\"\")","v":""},{"$f":"IF('Solar prot device - data'!J103<>\"\",'Solar prot device - data'!J103,\"\")","v":""},"","","","","","","","","",null,"","",""]
[null,{"$f":"'Solar prot device - data'!B104","v":90},{"$f":"IF('Solar prot device - data'!C104<>\"\",C$6&\" + \"&'Solar prot device - data'!C104,\"\")","v":""},{"$f":"IF('Solar prot device - data'!D104<>\"\",'Solar prot device - data'!D104,\"\")","v":""},{"$f":"IF('Solar prot device - data'!E104<>\"\",'Solar prot device - data'!E104,\"\")","v":""},{"$f":"IF('Solar prot device - data'!F104<>\"\",'Solar prot device - data'!F104,\"\")","v":""},{"$f":"IF('Solar prot device - data'!G104<>\"\",'Solar prot device - data'!G104,\"\")","v":""},{"$f":"IF('Solar prot device - data'!H104<>\"\",'Solar prot device - data'!H104,\"\")","v":""},{"$f":"IF('Solar prot device - data'!I104<>\"\",'Solar prot device - data'!I104,\"\")","v":""},{"$f":"IF('Solar prot device - data'!J104<>\"\",'Solar prot device - data'!J104,\"\")","v":""},"","","","","","","","","",null,"","",""]
[null,{"$f":"'Solar prot device - data'!B105","v":91},{"$f":"IF('Solar prot device - data'!C105<>\"\",C$6&\" + \"&'Solar prot device - data'!C105,\"\")","v":""},{"$f":"IF('Solar prot device - data'!D105<>\"\",'Solar prot device - data'!D105,\"\")","v":""},{"$f":"IF('Solar prot device - data'!E105<>\"\",'Solar prot device - data'!E105,\"\")","v":""},{"$f":"IF('Solar prot device - data'!F105<>\"\",'Solar prot device - data'!F105,\"\")","v":""},{"$f":"IF('Solar prot device - data'!G105<>\"\",'Solar prot device - data'!G105,\"\")","v":""},{"$f":"IF('Solar prot device - data'!H105<>\"\",'Solar prot device - data'!H105,\"\")","v":""},{"$f":"IF('Solar prot device - data'!I105<>\"\",'Solar prot device - data'!I105,\"\")","v":""},{"$f":"IF('Solar prot device - data'!J105<>\"\",'Solar prot device - data'!J105,\"\")","v":""},"","","","","","","","","",null,"","",""]
[null,{"$f":"'Solar prot device - data'!B106","v":92},{"$f":"IF('Solar prot device - data'!C106<>\"\",C$6&\" + \"&'Solar prot device - data'!C106,\"\")","v":""},{"$f":"IF('Solar prot device - data'!D106<>\"\",'Solar prot device - data'!D106,\"\")","v":""},{"$f":"IF('Solar prot device - data'!E106<>\"\",'Solar prot device - data'!E106,\"\")","v":""},{"$f":"IF('Solar prot device - data'!F106<>\"\",'Solar prot device - data'!F106,\"\")","v":""},{"$f":"IF('Solar prot device - data'!G106<>\"\",'Solar prot device - data'!G106,\"\")","v":""},{"$f":"IF('Solar prot device - data'!H106<>\"\",'Solar prot device - data'!H106,\"\")","v":""},{"$f":"IF('Solar prot device - data'!I106<>\"\",'Solar prot device - data'!I106,\"\")","v":""},{"$f":"IF('Solar prot device - data'!J106<>\"\",'Solar prot device - data'!J106,\"\")","v":""},"","","","","","","","","",null,"","",""]
[null,{"$f":"'Solar prot device - data'!B107","v":93},{"$f":"IF('Solar prot device - data'!C107<>\"\",C$6&\" + \"&'Solar prot device - data'!C107,\"\")","v":""},{"$f":"IF('Solar prot device - data'!D107<>\"\",'Solar prot device - data'!D107,\"\")","v":""},{"$f":"IF('Solar prot device - data'!E107<>\"\",'Solar prot device - data'!E107,\"\")","v":""},{"$f":"IF('Solar prot device - data'!F107<>\"\",'Solar prot device - data'!F107,\"\")","v":""},{"$f":"IF('Solar prot device - data'!G107<>\"\",'Solar prot device - data'!G107,\"\")","v":""},{"$f":"IF('Solar prot device - data'!H107<>\"\",'Solar prot device - data'!H107,\"\")","v":""},{"$f":"IF('Solar prot device - data'!I107<>\"\",'Solar prot device - data'!I107,\"\")","v":""},{"$f":"IF('Solar prot device - data'!J107<>\"\",'Solar prot device - data'!J107,\"\")","v":""},"","","","","","","","","",null,"","",""]
[null,{"$f":"'Solar prot device - data'!B108","v":94},{"$f":"IF('Solar prot device - data'!C108<>\"\",C$6&\" + \"&'Solar prot device - data'!C108,\"\")","v":""},{"$f":"IF('Solar prot device - data'!D108<>\"\",'Solar prot device - data'!D108,\"\")","v":""},{"$f":"IF('Solar prot device - data'!E108<>\"\",'Solar prot device - data'!E108,\"\")","v":""},{"$f":"IF('Solar prot device - data'!F108<>\"\",'Solar prot device - data'!F108,\"\")","v":""},{"$f":"IF('Solar prot device - data'!G108<>\"\",'Solar prot device - data'!G108,\"\")","v":""},{"$f":"IF('Solar prot device - data'!H108<>\"\",'Solar prot device - data'!H108,\"\")","v":""},{"$f":"IF('Solar prot device - data'!I108<>\"\",'Solar prot device - data'!I108,\"\")","v":""},{"$f":"IF('Solar prot device - data'!J108<>\"\",'Solar prot device - data'!J108,\"\")","v":""},"","","","","","","","","",null,"","",""]
[null,{"$f":"'Solar prot device - data'!B109","v":95},{"$f":"IF('Solar prot device - data'!C109<>\"\",C$6&\" + \"&'Solar prot device - data'!C109,\"\")","v":""},{"$f":"IF('Solar prot device - data'!D109<>\"\",'Solar prot device - data'!D109,\"\")","v":""},{"$f":"IF('Solar prot device - data'!E109<>\"\",'Solar prot device - data'!E109,\"\")","v":""},{"$f":"IF('Solar prot device - data'!F109<>\"\",'Solar prot device - data'!F109,\"\")","v":""},{"$f":"IF('Solar prot device - data'!G109<>\"\",'Solar prot device - data'!G109,\"\")","v":""},{"$f":"IF('Solar prot device - data'!H109<>\"\",'Solar prot device - data'!H109,\"\")","v":""},{"$f":"IF('Solar prot device - data'!I109<>\"\",'Solar prot device - data'!I109,\"\")","v":""},{"$f":"IF('Solar prot device - data'!J109<>\"\",'Solar prot device - data'!J109,\"\")","v":""},"","","","","","","","","",null,"","",""]
[null,{"$f":"'Solar prot device - data'!B110","v":96},{"$f":"IF('Solar prot device - data'!C110<>\"\",C$6&\" + \"&'Solar prot device - data'!C110,\"\")","v":""},{"$f":"IF('Solar prot device - data'!D110<>\"\",'Solar prot device - data'!D110,\"\")","v":""},{"$f":"IF('Solar prot device - data'!E110<>\"\",'Solar prot device - data'!E110,\"\")","v":""},{"$f":"IF('Solar prot device - data'!F110<>\"\",'Solar prot device - data'!F110,\"\")","v":""},{"$f":"IF('Solar prot device - data'!G110<>\"\",'Solar prot device - data'!G110,\"\")","v":""},{"$f":"IF('Solar prot device - data'!H110<>\"\",'Solar prot device - data'!H110,\"\")","v":""},{"$f":"IF('Solar prot device - data'!I110<>\"\",'Solar prot device - data'!I110,\"\")","v":""},{"$f":"IF('Solar prot device - data'!J110<>\"\",'Solar prot device - data'!J110,\"\")","v":""},"","","","","","","","","",null,"","",""]
[null,{"$f":"'Solar prot device - data'!B111","v":97},{"$f":"IF('Solar prot device - data'!C111<>\"\",C$6&\" + \"&'Solar prot device - data'!C111,\"\")","v":""},{"$f":"IF('Solar prot device - data'!D111<>\"\",'Solar prot device - data'!D111,\"\")","v":""},{"$f":"IF('Solar prot device - data'!E111<>\"\",'Solar prot device - data'!E111,\"\")","v":""},{"$f":"IF('Solar prot device - data'!F111<>\"\",'Solar prot device - data'!F111,\"\")","v":""},{"$f":"IF('Solar prot device - data'!G111<>\"\",'Solar prot device - data'!G111,\"\")","v":""},{"$f":"IF('Solar prot device - data'!H111<>\"\",'Solar prot device - data'!H111,\"\")","v":""},{"$f":"IF('Solar prot device - data'!I111<>\"\",'Solar prot device - data'!I111,\"\")","v":""},{"$f":"IF('Solar prot device - data'!J111<>\"\",'Solar prot device - data'!J111,\"\")","v":""},"","","","","","","","","",null,"","",""]
[null,{"$f":"'Solar prot device - data'!B112","v":98},{"$f":"IF('Solar prot device - data'!C112<>\"\",C$6&\" + \"&'Solar prot device - data'!C112,\"\")","v":""},{"$f":"IF('Solar prot device - data'!D112<>\"\",'Solar prot device - data'!D112,\"\")","v":""},{"$f":"IF('Solar prot device - data'!E112<>\"\",'Solar prot device - data'!E112,\"\")","v":""},{"$f":"IF('Solar prot device - data'!F112<>\"\",'Solar prot device - data'!F112,\"\")","v":""},{"$f":"IF('Solar prot device - data'!G112<>\"\",'Solar prot device - data'!G112,\"\")","v":""},{"$f":"IF('Solar prot device - data'!H112<>\"\",'Solar prot device - data'!H112,\"\")","v":""},{"$f":"IF('Solar prot device - data'!I112<>\"\",'Solar prot device - data'!I112,\"\")","v":""},{"$f":"IF('Solar prot device - data'!J112<>\"\",'Solar prot device - data'!J112,\"\")","v":""},"","","","","","","","","",null,"","",""]
[null,{"$f":"'Solar prot device - data'!B113","v":99},{"$f":"IF('Solar prot device - data'!C113<>\"\",C$6&\" + \"&'Solar prot device - data'!C113,\"\")","v":""},{"$f":"IF('Solar prot device - data'!D113<>\"\",'Solar prot device - data'!D113,\"\")","v":""},{"$f":"IF('Solar prot device - data'!E113<>\"\",'Solar prot device - data'!E113,\"\")","v":""},{"$f":"IF('Solar prot device - data'!F113<>\"\",'Solar prot device - data'!F113,\"\")","v":""},{"$f":"IF('Solar prot device - data'!G113<>\"\",'Solar prot device - data'!G113,\"\")","v":""},{"$f":"IF('Solar prot device - data'!H113<>\"\",'Solar prot device - data'!H113,\"\")","v":""},{"$f":"IF('Solar prot device - data'!I113<>\"\",'Solar prot device - data'!I113,\"\")","v":""},{"$f":"IF('Solar prot device - data'!J113<>\"\",'Solar prot device - data'!J113,\"\")","v":""},"","","","","","","","","",null,"","",""]
[null,{"$f":"'Solar prot device - data'!B114","v":100},{"$f":"IF('Solar prot device - data'!C114<>\"\",C$6&\" + \"&'Solar prot device - data'!C114,\"\")","v":""},{"$f":"IF('Solar prot device - data'!D114<>\"\",'Solar prot device - data'!D114,\"\")","v":""},{"$f":"IF('Solar prot device - data'!E114<>\"\",'Solar prot device - data'!E114,\"\")","v":""},{"$f":"IF('Solar prot device - data'!F114<>\"\",'Solar prot device - data'!F114,\"\")","v":""},{"$f":"IF('Solar prot device - data'!G114<>\"\",'Solar prot device - data'!G114,\"\")","v":""},{"$f":"IF('Solar prot device - data'!H114<>\"\",'Solar prot device - data'!H114,\"\")","v":""},{"$f":"IF('Solar prot device - data'!I114<>\"\",'Solar prot device - data'!I114,\"\")","v":""},{"$f":"IF('Solar prot device - data'!J114<>\"\",'Solar prot device - data'!J114,\"\")","v":""},"","","","","","","","","",null,"","",""]

{"sheet":"Results-2","index":7,"n_rows":54,"n_cols":32,"rows_kept":54,"cut":false,"hidden":false,"merged":[[3,6,4,8],[2,1,2,9],[1,1,1,11]]}
[]
[null,"The following chart gives the total solar energy transmittance gtotal for the combination glazing - solar protection device. The solar protection device can be external, internal or integrated between the panes. The effect of different U-values and g-values of the glazing on the total solar energy transmittance of the combination is shown. Please, note that the calculation are done for combination of Ug you specify, and all g-values between 0.18 and 0.85, independently of the fact that such glazing exist or not."]
[null,"Choose the solar protection device that you want to analyse :"]
[null,null,null,null,null,null,"(See sheet \"Solar prot device - data\")",null,null,null,null,null,null,null,null,null,null,null,"Glazing","U1",{"$f":"D14","v":2.9},"(U=thermal transmittance in [W/(m²K)])"]
[null,"10",null,null,null,null,null,null,null,null,null,null,null,null,null,null,null,null,null,"U2",{"$f":"D15","v":1.1000000000000001}]
[null,null,null,null,null,null,null,null,null,null,null,null,null,null,null,null,null,null,null,"U3",{"$f":"D16","v":0.8}]
[null,"Blind","Name:",{"$f":"VLOOKUP($U$7,'Solar prot device - data'!$B$15:$E$114,2)","v":"High translucent - Pastel"},null,null,null,null,null,null,null,null,null,null,null,null,null,null,"Blind","n°",{"$f":"B5*1","v":10},null,null,"G1",5,"W/m²K"]
[null,null,"τe,B *",{"$f":"IF(VLOOKUP($U$7,'Solar prot device - data'!$B$15:$G$114,3)<>\"\",VLOOKUP($U$7,'Solar prot device - data'!$B$15:$G$114,3),\"\")","v":0.4},null,null,null,null,null,null,null,null,null,null,null,null,null,null,null,"Name",{"$f":"VLOOKUP($U$7,'Solar prot device - data'!$B$15:$E$114,2)","v":"High translucent - Pastel"},null,null,"G2 ext",10,"W/m²K"]
[null,null,"ρe,B * ",{"$f":"IF(VLOOKUP($U$7,'Solar prot device - data'!$B$15:$G$114,4)<>\"\",VLOOKUP($U$7,'Solar prot device - data'!$B$15:$G$114,4),\"\")","v":0.3},null,null,null,null,null,null,null,null,null,null,null,null,null,null,null,"te,B",{"$f":"D8","v":0.4},null,null,"G2 int",30,"W/m²K"]
[null,null,"αe,B",{"$f":"IF(VLOOKUP($U$7,'Solar prot device - data'!$B$15:$G$114,6)<>\"\",VLOOKUP($U$7,'Solar prot device - data'!$B$15:$G$114,6),\"\")","v":0.3},null,null,null,null,null,null,null,null,null,null,null,null,null,null,null,"re,B",{"$f":"D9","v":0.3},null,null,"G3",3,"W/m²K"]
[null,null,null,null,null,null,null,null,null,null,null,null,null,null,null,null,null,null,null,"a e,B",{"$f":"D10","v":0.3}]
[null,"Specify 3 Ug-values :"]
[]
[null,"Glazing","Ug 1",2.9,"W/(m².K)","Show","Internal"]
[null,null,"Ug 2",1.1000000000000001,"W/(m².K)",null,"External",null,null,null,null,null,null,null,null,null,null,null,null,null,null,"External, ","External, ","External, ",null,"Internal, ","Internal, ","Internal, ",null,"Between, ","Between, ","Between, "]
[null,null,"Ug 3",0.8,"W/(m².K)",null,"Between",null,null,null,null,null,null,null,null,null,null,null,null,null,null,{"$f":"CONCATENATE(\"Ug=\",D14)","v":"Ug=2.9"},{"$f":"CONCATENATE(\"Ug=\",D15)","v":"Ug=1.1"},{"$f":"CONCATENATE(\"Ug=\",D16)","v":"Ug=0.8"},null,{"$f":"CONCATENATE(\"Ug=\",$D14)","v":"Ug=2.9"},{"$f":"CONCATENATE(\"Ug=\",$D15)","v":"Ug=1.1"},{"$f":"CONCATENATE(\"Ug=\",$D16)","v":"Ug=0.8"},null,{"$f":"CONCATENATE(\"Ug=\",$D14)","v":"Ug=2.9"},{"$f":"CONCATENATE(\"Ug=\",$D15)","v":"Ug=1.1"},{"$f":"CONCATENATE(\"Ug=\",$D16)","v":"Ug=0.8"}]
[null,null,null,null,null,null,null,null,null,null,null,null,null,null,null,null,null,null,null,"U glazing",null,{"$f":"$U$4","v":2.9},{"$f":"$U$5","v":1.1000000000000001},{"$f":"$U$6","v":0.8},null,{"$f":"$U$4","v":2.9},{"$f":"$U$5","v":1.1000000000000001},{"$f":"$U$6","v":0.8},null,{"$f":"$U$4","v":2.9},{"$f":"$U$5","v":1.1000000000000001},{"$f":"$U$6","v":0.8}]
[null,null,null,null,null,null,null,null,null,null,null,null,null,null,null,null,null,null,null,"G",null,{"$f":"1/(1/V$17+1/$Y$7+1/$Y$8)","v":1.5508021390374334},{"$f":"1/(1/W$17+1/$Y$7+1/$Y$8)","v":0.82706766917293228},{"$f":"1/(1/X$17+1/$Y$7+1/$Y$8)","v":0.64516129032258063},null,{"$f":"1/(1/Z$17+1/$Y$9)","v":2.6443768996960486},{"$f":"1/(1/AA$17+1/$Y$9)","v":1.0610932475884245},{"$f":"1/(1/AB$17+1/$Y$9)","v":0.77922077922077915},null,{"$f":"1/(1/$AD17+1/$Y10)","v":1.4745762711864407},{"$f":"1/(1/$AE17+1/$Y10)","v":0.80487804878048785},{"$f":"1/(1/$AF17+1/$Y10)","v":0.63157894736842113}]
[]
[]
[null,null,null,null," ",null,null,null,null,null,null,null,null,null,null,null,null,null,null,"g glazing"]
[]
[null,null,null,null,null,null,null,null,null,null,null,null,null,null,null,null,null,null,null,0.15,null,{"$f":"$U$9*$T23+$U$11*V$18/$Y$8+$U$9*(1-$T23)*V$18/$Y$7","v":0.21197860962566845},0.14105263157894737,0.12322580645161289,null,{"$f":"$T23*(1-$T23*$U$10-$U$11*Z$18/$Y$9)","v":0.13928343465045592},0.14165836012861735,0.14208116883116881,null,{"$f":"$T23*$U$9+$T23*($U$11+(1-$T23)*$U$10)*AD$18/$Y$10","v":0.10091949152542373},8.2335365853658526E-2,7.7526315789473679E-2]
[null,null,null,null,null,null,null,null,null,null,null,null,null,null,null,null,null,null,null,0.2,null,0.22577540106951877,0.15774436090225566,0.14064516129032259,null,0.18271124620060791,0.18587781350482313,0.18644155844155844,null,0.1330847457627119,0.10897560975609759,0.10273684210526318]
[null,null,null,null,null,null,null,null,null,null,null,null,null,null,null,null,null,null,null,0.25,null,0.23957219251336903,0.17443609022556392,0.15806451612903227,null,0.2246390577507599,0.22859726688102894,0.22930194805194806,null,0.16451271186440677,0.13521341463414635,0.12763157894736843]
[null,null,null,null,null,null,null,null,null,null,null,null,null,null,null,null,null,null,null,0.3,null,0.25336898395721924,0.19112781954887217,0.17548387096774193,null,0.26506686930091189,0.26981672025723469,0.27066233766233766,null,0.19520338983050847,0.16104878048780488,0.15221052631578946]
[null,null,null,null,null,null,null,null,null,null,null,null,null,null,null,null,null,null,null,0.35,null,0.26716577540106956,0.20781954887218046,0.19290322580645158,null,0.30399468085106385,0.30953617363344049,0.31052272727272728,null,0.22515677966101694,0.18648170731707314,0.17647368421052631]
[null,null,null,null,null,null,null,null,null,null,null,null,null,null,null,null,null,null,null,0.4,null,0.28096256684491983,0.22451127819548877,0.21032258064516132,null,0.34142249240121586,0.3477556270096463,0.34888311688311691,null,0.25437288135593222,0.21151219512195127,0.200421052631579]
[null,null,null,null,null,null,null,null,null,null,null,null,null,null,null,null,null,null,null,0.45,null,0.29475935828877009,0.24120300751879703,0.22774193548387098,null,0.37735030395136782,0.3844750803858521,0.38574350649350647,null,0.28285169491525425,0.23614024390243904,0.22405263157894739]
[null,null,null,null,null,null,null,null,null,null,null,null,null,null,null,null,null,null,null,0.5,null,0.30855614973262036,0.25789473684210529,0.24516129032258066,null,0.41177811550151977,0.41969453376205784,0.42110389610389609,null,0.31059322033898307,0.26036585365853659,0.2473684210526316]
[null,null,null,null,null,null,null,null,null,null,null,null,null,null,null,null,null,null,null,0.55000000000000004,null,0.32235294117647062,0.27458646616541355,0.26258064516129032,null,0.44470592705167178,0.45341398713826364,0.45496428571428571,null,0.33759745762711868,0.28418902439024396,0.27036842105263159]
[null,null,null,null,null,null,null,null,null,null,null,null,null,null,null,null,null,null,null,0.6,null,0.33614973262032083,0.2912781954887218,0.27999999999999997,null,0.47613373860182373,0.48563344051446944,0.48732467532467533,null,0.36386440677966103,0.30760975609756097,0.29305263157894734]
[null,null,null,null,null,null,null,null,null,null,null,null,null,null,null,null,null,null,null,0.65,null,0.34994652406417115,0.30796992481203006,0.29741935483870968,null,0.50606155015197574,0.51635289389067518,0.51818506493506489,null,0.38939406779661018,0.33062804878048779,0.31542105263157894]
[null,null,null,null,null,null,null,null,null,null,null,null,null,null,null,null,null,null,null,0.7,null,0.36374331550802136,0.32466165413533832,0.31483870967741934,null,0.53448936170212769,0.54557234726688097,0.54754545454545456,null,0.41418644067796606,0.35324390243902437,0.33747368421052626]
[null,null,null,null,null,null,null,null,null,null,null,null,null,null,null,null,null,null,null,0.75,null,0.37754010695187168,0.34135338345864663,0.33225806451612905,null,0.56141717325227969,0.57329180064308682,0.57540584415584417,null,0.43824152542372885,0.37545731707317076,0.35921052631578954]
[null,null,null,null,null,null,null,null,null,null,null,null,null,null,null,null,null,null,null,0.8,null,0.39133689839572194,0.35804511278195494,0.34967741935483876,null,0.58684498480243164,0.59951125401929262,0.60176623376623384,null,0.46155932203389838,0.3972682926829269,0.38063157894736849]
[null,null,null,null,null,null,null,null,null,null,null,null,null,null,null,null,null,null,null,0.85,null,0.40513368983957221,0.37473684210526315,0.36709677419354841,null,0.61077279635258364,0.62423070739549835,0.62662662337662334,null,0.48413983050847459,0.41867682926829269,0.40173684210526317]
[null,null,null,null,null,null,null,null,null,null,null,null,null,null,null,null,null,null,null,null,null,{"$f":"IF($V39,V15&V16,\"\")","v":"External, Ug=2.9"},{"$f":"IF($V39,W15&W16,\"\")","v":"External, Ug=1.1"},{"$f":"IF($V39,X15&X16,\"\")","v":"External, Ug=0.8"},null,{"$f":"IF($Z39,Z15&Z16,\"\")","v":"Internal, Ug=2.9"},{"$f":"IF($Z39,AA15&AA16,\"\")","v":"Internal, Ug=1.1"},{"$f":"IF($Z39,AB15&AB16,\"\")","v":"Internal, Ug=0.8"},null,{"$f":"IF($AD39,AD15&AD16,\"\")","v":"Between, Ug=2.9"},{"$f":"IF($AD39,AE15&AE16,\"\")","v":"Between, Ug=1.1"},{"$f":"IF($AD39,AF15&AF16,\"\")","v":"Between, Ug=0.8"}]
[null,null,null,null,null,null,null,null,null,null,null,null,null,null,null,null,null,null,null,"Toont",null,true,null,null,"g",true,null,null,"g",true]
[null,null,null,null,null,null,null,null,null,null,null,null,null,null,null,null,null,null,null,{"$f":"IF(V$39,$T23,\"\")","v":0.15},null,{"$f":"IF($V$39,V23,\"\")","v":0.21197860962566845},0.14105263157894737,0.12322580645161289,{"$f":"IF(Z$39,$T23,\"\")","v":0.15},{"$f":"IF($Z$39,Z23,\"\")","v":0.13928343465045592},0.14165836012861735,0.14208116883116881,{"$f":"IF(AD$39,$T23,\"\")","v":0.15},{"$f":"IF($AD$39,AD23,\"\")","v":0.10091949152542373},8.2335365853658526E-2,7.7526315789473679E-2]
[null,null,null,null,null,null,null,null,null,null,null,null,null,null,null,null,null,null,null,0.2,null,0.22577540106951877,0.15774436090225566,0.14064516129032259,0.2,0.18271124620060791,0.18587781350482313,0.18644155844155844,0.2,0.1330847457627119,0.10897560975609759,0.10273684210526318]
[null,null,null,null,null,null,null,null,null,null,null,null,null,null,null,null,null,null,null,0.25,null,0.23957219251336903,0.17443609022556392,0.15806451612903227,0.25,0.2246390577507599,0.22859726688102894,0.22930194805194806,0.25,0.16451271186440677,0.13521341463414635,0.12763157894736843]
[null,null,null,null,null,null,null,null,null,null,null,null,null,null,null,null,null,null,null,0.3,null,0.25336898395721924,0.19112781954887217,0.17548387096774193,0.3,0.26506686930091189,0.26981672025723469,0.27066233766233766,0.3,0.19520338983050847,0.16104878048780488,0.15221052631578946]
[null,null,null,null,null,null,null,null,null,null,null,null,null,null,null,null,null,null,null,0.35,null,0.26716577540106956,0.20781954887218046,0.19290322580645158,0.35,0.30399468085106385,0.30953617363344049,0.31052272727272728,0.35,0.22515677966101694,0.18648170731707314,0.17647368421052631]
[null,null,null,null,null,null,null,null,null,null,null,null,null,null,null,null,null,null,null,0.4,null,0.28096256684491983,0.22451127819548877,0.21032258064516132,0.4,0.34142249240121586,0.3477556270096463,0.34888311688311691,0.4,0.25437288135593222,0.21151219512195127,0.200421052631579]
[null,null,null,null,null,null,null,null,null,null,null,null,null,null,null,null,null,null,null,0.45,null,0.29475935828877009,0.24120300751879703,0.22774193548387098,0.45,0.37735030395136782,0.3844750803858521,0.38574350649350647,0.45,0.28285169491525425,0.23614024390243904,0.22405263157894739]
[null,null,null,null,null,null,null,null,null,null,null,null,null,null,null,null,null,null,null,0.5,null,0.30855614973262036,0.25789473684210529,0.24516129032258066,0.5,0.41177811550151977,0.41969453376205784,0.42110389610389609,0.5,0.31059322033898307,0.26036585365853659,0.2473684210526316]
[null,null,null,null,null,null,null,null,null,null,null,null,null,null,null,null,null,null,null,0.55000000000000004,null,0.32235294117647062,0.27458646616541355,0.26258064516129032,0.55000000000000004,0.44470592705167178,0.45341398713826364,0.45496428571428571,0.55000000000000004,0.33759745762711868,0.28418902439024396,0.27036842105263159]
[null,null,null,null,null,null,null,null,null,null,null,null,null,null,null,null,null,null,null,0.6,null,0.33614973262032083,0.2912781954887218,0.27999999999999997,0.6,0.47613373860182373,0.48563344051446944,0.48732467532467533,0.6,0.36386440677966103,0.30760975609756097,0.29305263157894734]
[null,null,null,null,null,null,null,null,null,null,null,null,null,null,null,null,null,null,null,0.65,null,0.34994652406417115,0.30796992481203006,0.29741935483870968,0.65,0.50606155015197574,0.51635289389067518,0.51818506493506489,0.65,0.38939406779661018,0.33062804878048779,0.31542105263157894]
[null,null,null,null,null,null,null,null,null,null,null,null,null,null,null,null,null,null,null,0.7,null,0.36374331550802136,0.32466165413533832,0.31483870967741934,0.7,0.53448936170212769,0.54557234726688097,0.54754545454545456,0.7,0.41418644067796606,0.35324390243902437,0.33747368421052626]
[null,null,null,null,null,null,null,null,null,null,null,null,null,null,null,null,null,null,null,0.75,null,0.37754010695187168,0.34135338345864663,0.33225806451612905,0.75,0.56141717325227969,0.57329180064308682,0.57540584415584417,0.75,0.43824152542372885,0.37545731707317076,0.35921052631578954]
[null,null,null,null,null,null,null,null,null,null,null,null,null,null,null,null,null,null,null,0.8,null,{"$f":"IF($V$39,V36,\"\")","v":0.39133689839572194},0.35804511278195494,0.34967741935483876,0.8,{"$f":"IF($Z$39,Z36,\"\")","v":0.58684498480243164},0.59951125401929262,0.60176623376623384,0.8,{"$f":"IF($AD$39,AD36,\"\")","v":0.46155932203389838},0.3972682926829269,0.38063157894736849]
[null,null,null,null,null,null,null,null,null,null,null,null,null,null,null,null,null,null,null,0.85,null,0.40513368983957221,0.37473684210526315,0.36709677419354841,0.85,0.61077279635258364,0.62423070739549835,0.62662662337662334,0.85,0.48413983050847459,0.41867682926829269,0.40173684210526317]

{"sheet":"Results-3","index":8,"n_rows":114,"n_cols":69,"rows_kept":114,"cut":false,"hidden":false,"merged":[[11,47,11,61],[12,9,12,13],[12,14,12,18],[12,19,12,23],[12,25,12,29],[12,30,12,34],[12,57,12,61],[12,52,12,56],[12,47,12,51],[12,36,12,40],[12,41,12,45],[10,1,10,13],[1,1,1,23],[11,9,11,23],[11,25,11,34],[11,36,11,45]]}
[]
[null,"Calculation of the total solar energy transmittance (gtot), the direct solar transmittance τe,tot and the secondary internal heat transfer factor qi,tot for the combination of the reference glazing indicated in the standard EN 14501:2021 and the specified solar protection devices (see characteristics in sheet \"Solar prot. device-data\").",null,null,null,null,null,null,null,null,null,null,null,null,null,null,null,null,null,null,null,null,null,null,null,null,null,null,null,null,null,null,null,null,null,null,null,null,null,null,null,null,null,null,null,null,null,null,null,null,null,null,null,null,null,null,null,null,null,null,null,null,null,null,"Glazing A","Glazing B","Glazing C","Glazing A","Glazing B"]
[null,null,null,null,null,null,null,null,null,null,null,null,null,null,null,null,null,null,null,null,null,null,null,null,null,null,null,null,null,null,null,null,null,null,null,null,null,null,null,null,null,null,null,null,null,null,null,null,null,null,null,null,null,null,null,null,null,null,null,null,null,null,null,"U",{"$f":"$D5","v":5.8},{"$f":"$D6","v":2.9},{"$f":"$D7","v":1.2},{"$f":"$D8","v":1.1000000000000001},{"$f":"$D9","v":0.8}]
[null,null,null,"Ug","g","τe,B","ρe,B","ρ'e,B ",null,null,null,null,null,null,null,null,null,null,null,null,null,null,null,null,null,null,null,null,null,null,null,null,null,null,null,null,null,null,null,null,null,null,null,null,null,null,null,null,null,null,null,null,null,null,null,null,null,null,null,null,null,null,null,"g",{"$f":"$E5","v":0.85},{"$f":"$E6","v":0.76},{"$f":"$E7","v":0.59},{"$f":"$E8","v":0.32},{"$f":"$E9","v":0.55000000000000004}]
[null,null,"Glazing A",5.8,0.85,0.83,0.08,0.08,null,null,null,null,null,null,null,null,null,null,null,null,null,null,null,null,null,null,null,null,null,null,null,null,null,null,null,null,null,null,null,null,null,null,null,null,null,null,null,null,null,null,null,null,null,null,null,null,null,null,null,null,null,null,null,"G1",5,5,5,5,5]
[null,null,"Glazing B",2.9,0.76,0.69,0.14000000000000001,0.14000000000000001,null,null,null,null,null,null,null,null,null,null,null,null,null,null,null,null,null,null,null,null,null,null,null,null,null,null,null,null,null,null,null,null,null,null,null,null,null,null,null,null,null,null,null,null,null,null,null,null,null,null,null,null,null,null,null,"G2 ext",10,10,10,10,10]
[null,null,"Glazing C",1.2,0.59,0.49,0.28999999999999998,0.27,null,null,null,null,null,null,null,null,null,null,null,null,null,null,null,null,null,null,null,null,null,null,null,null,null,null,null,null,null,null,null,null,null,null,null,null,null,null,null,null,null,null,null,null,null,null,null,null,null,null,null,null,null,null,null,"G2 int",30,30,30,30,30]
[null,null,"Glazing D",1.1000000000000001,0.32,0.27,0.28999999999999998,0.38,null,null,null,null,null,null,null,null,null,null,null,null,null,null,null,null,null,null,null,null,null,null,null,null,null,null,null,null,null,null,null,null,null,null,null,null,null,null,null,null,null,null,null,null,null,null,null,null,null,null,null,null,null,null,null,"G3",3,3,3,3,3]
[null,null,"Glazing E",0.8,0.55000000000000004,0.5,0.22,0.23,null,null,null,null,null,null,null,null,null,null,null,null,null,null,null,null,null,null,null,null,null,null,null,null,null,null,null,null,null,null,null,null,null,null,null,null,null,null,null,null,null,null,null,null,null,null,null,null,null,null,null,null,null,null,null,"G ext",{"$f":"1/(1/BM$3+1/BM$5+1/BM$6)","v":2.1167883211678831},{"$f":"1/(1/BN$3+1/BN$5+1/BN$6)","v":1.5508021390374334},{"$f":"1/(1/BO$3+1/BO$5+1/BO$6)","v":0.88235294117647045},{"$f":"1/(1/BP$3+1/BP$5+1/BP$6)","v":0.82706766917293228},{"$f":"1/(1/BQ$3+1/BQ$5+1/BQ$6)","v":0.64516129032258063}]
[null,null,null,null,null,null,null,null,null,null,null,null,null,null,null,null,null,null,null,null,null,null,null,null,null,null,null,null,null,null,null,null,null,null,null,null,null,null,null,null,null,null,null,null,null,null,null,null,null,null,null,null,null,null,null,null,null,null,null,null,null,null,null,"G int",{"$f":"1/(1/BM$3+1/BM$7)","v":4.8603351955307259},{"$f":"1/(1/BN$3+1/BN$7)","v":2.6443768996960486},{"$f":"1/(1/BO$3+1/BO$7)","v":1.1538461538461537},{"$f":"1/(1/BP$3+1/BP$7)","v":1.0610932475884245},{"$f":"1/(1/BQ$3+1/BQ$7)","v":0.77922077922077915}]
[null,null,null,null,null,null,null,null,null,null,null,null,null,null,null,null,null,null,null,null,null,null,null,null,null,null,null,null,null,null,null,null,null,null,null,null,null,null,null,null,null,null,null,null,null,null,null,null,null,null,null,null,null,null,null,null,null,null,null,null,null,null,null,"G between",{"$f":"1/(1/BM$3+1/BM$8)","v":1.9772727272727271},{"$f":"1/(1/BN$3+1/BN$8)","v":1.4745762711864407},{"$f":"1/(1/BO$3+1/BO$8)","v":0.8571428571428571},{"$f":"1/(1/BP$3+1/BP$8)","v":0.80487804878048785},{"$f":"1/(1/BQ$3+1/BQ$8)","v":0.63157894736842113}]
[null,null,null,null,null,null,null,null,null,"SOLAR FACTOR gtot ",null,null,null,null,null,null,null,null,null,null,null,null,null,null,null,"DIRECT SOLAR TRANSMITTANCE τe,tot ",null,null,null,null,null,null,null,null,null,null,"SECONDARY INTERNAL HEAT TRANSFER FACTOR qi,tot ",null,null,null,null,null,null,null,null,null,null,"SHADING FACTOR Fc "]
[null,null,null,null,null,null,null,null,null,"External protection device",null,null,null,null,"Internal protection device",null,null,null,null,"Integrated protection device",null,null,null,null,null,"External protection device",null,null,null,null,"Internal protection device",null,null,null,null,null,"External protection device",null,null,null,null,"Internal protection device",null,null,null,null,null,"External protection device",null,null,null,null,"Internal protection device",null,null,null,null,"Integrated protection device"]
[null,"Comb. Nr","Name of the combination glazing + blind",null,null,"τe,B","ρe,B","ρ'e,B ","αe,B","Glazing A","Glazing B","Glazing C","Glazing D","Glazing E","Glazing A","Glazing B","Glazing C","Glazing D","Glazing E","Glazing A","Glazing B","Glazing C","Glazing D","Glazing E",null,"Glazing A","Glazing B","Glazing C","Glazing D","Glazing E","Glazing A","Glazing B","Glazing C","Glazing D","Glazing E",null,"Glazing A","Glazing B","Glazing C","Glazing D","Glazing E","Glazing A","Glazing B","Glazing C","Glazing D","Glazing E",null,"Glazing A","Glazing B","Glazing C","Glazing D","Glazing E","Glazing A","Glazing B","Glazing C","Glazing D","Glazing E","Glazing A","Glazing B","Glazing C","Glazing D","Glazing E"]
[null,{"$f":"'Solar prot device - data'!B15","v":1},{"$f":"IF('Solar prot device - data'!C15<>\"\",\"Glazing\"&\" + \"&'Solar prot device - data'!C15,\"\")","v":"Glazing + Opaque - White"},null,null,{"$f":"IF('Solar prot device - data'!D15<>\"\",'Solar prot device - data'!D15,\"\")","v":0},{"$f":"IF('Solar prot device - data'!E15<>\"\",'Solar prot device - data'!E15,\"\")","v":0.7},{"$f":"IF('Solar prot device - data'!F15<>\"\",'Solar prot device - data'!F15,\"\")","v":0.7},{"$f":"IF('Solar prot device - data'!G15<>\"\",'Solar prot device - data'!G15,\"\")","v":0.30000000000000004},{"$f":"IF(AND($F15<>\"\",$G15<>\"\"),$F15*BM$4+$I15*BM$9/BM$6+$F15*(1-BM$4)*BM$9/BM$5,\"\")","v":6.3503649635036491E-2},{"$f":"IF(AND($F15<>\"\",$G15<>\"\"),$F15*BN$4+$I15*BN$9/BN$6+$F15*(1-BN$4)*BN$9/BN$5,\"\")","v":4.6524064171123009E-2},{"$f":"IF(AND($F15<>\"\",$G15<>\"\"),$F15*BO$4+$I15*BO$9/BO$6+$F15*(1-BO$4)*BO$9/BO$5,\"\")","v":2.6470588235294117E-2},{"$f":"IF(AND($F15<>\"\",$G15<>\"\"),$F15*BP$4+$I15*BP$9/BP$6+$F15*(1-BP$4)*BP$9/BP$5,\"\")","v":2.4812030075187973E-2},{"$f":"IF(AND($F15<>\"\",$G15<>\"\"),$F15*BQ$4+$I15*BQ$9/BQ$6+$F15*(1-BQ$4)*BQ$9/BQ$5,\"\")","v":1.935483870967742E-2},{"$f":"IF(AND($F15<>\"\",$G15<>\"\"),BM$4*(1-BM$4*$G15-$I15*BM$10/BM$7),\"\")","v":0.30293715083798883},{"$f":"IF(AND($F15<>\"\",$G15<>\"\"),BN$4*(1-BN$4*$G15-$I15*BN$10/BN$7),\"\")","v":0.33558273556231011},{"$f":"IF(AND($F15<>\"\",$G15<>\"\"),BO$4*(1-BO$4*$G15-$I15*BO$10/BO$7),\"\")","v":0.33952230769230768},{"$f":"IF(AND($F15<>\"\",$G15<>\"\"),BP$4*(1-BP$4*$G15-$I15*BP$10/BP$7),\"\")","v":0.24492450160771703},{"$f":"IF(AND($F15<>\"\",$G15<>\"\"),BQ$4*(1-BQ$4*$G15-$I15*BQ$10/BQ$7),\"\")","v":0.33396428571428571},{"$f":"IF(AND($F15<>\"\",$G15<>\"\"),BM$4*$F15+BM$4*($I15+(1-BM$4)*$G15)*BM$11/BM$8,\"\")","v":0.22689204545454544},{"$f":"IF(AND($F15<>\"\",$G15<>\"\"),BN$4*$F15+BN$4*($I15+(1-BN$4)*$G15)*BN$11/BN$8,\"\")","v":0.17482576271186445},{"$f":"IF(AND($F15<>\"\",$G15<>\"\"),BO$4*$F15+BO$4*($I15+(1-BO$4)*$G15)*BO$11/BO$8,\"\")","v":9.8951428571428565E-2},{"$f":"IF(AND($F15<>\"\",$G15<>\"\"),BP$4*$F15+BP$4*($I15+(1-BP$4)*$G15)*BP$11/BP$8,\"\")","v":6.6622439024390259E-2},{"$f":"IF(AND($F15<>\"\",$G15<>\"\"),BQ$4*$F15+BQ$4*($I15+(1-BQ$4)*$G15)*BQ$11/BQ$8,\"\")","v":7.1210526315789488E-2},null,{"$f":"IF(AND($F15<>\"\",$H15<>\"\"),$F$5*$F15/(1-$G$5*$H15),\"\")","v":0},{"$f":"IF(AND($F15<>\"\",$H15<>\"\"),$F$6*$F15/(1-$G$6*$H15),\"\")","v":0},{"$f":"IF(AND($F15<>\"\",$H15<>\"\"),$F$7*$F15/(1-$G$7*$H15),\"\")","v":0},{"$f":"IF(AND($F15<>\"\",$H15<>\"\"),$F$8*$F15/(1-$G$8*$H15),\"\")","v":0},{"$f":"IF(AND($F15<>\"\",$H15<>\"\"),$F$9*$F15/(1-$G$9*$H15),\"\")","v":0},{"$f":"IF(AND($F15<>\"\",$G15<>\"\"),$F$5*$F15/(1-$H$5*$G15),\"\")","v":0},{"$f":"IF(AND($F15<>\"\",$G15<>\"\"),$F$6*$F15/(1-$H$6*$G15),\"\")","v":0},{"$f":"IF(AND($F15<>\"\",$G15<>\"\"),$F$7*$F15/(1-$H$7*$G15),\"\")","v":0},{"$f":"IF(AND($F15<>\"\",$G15<>\"\"),$F$8*$F15/(1-$H$8*$G15),\"\")","v":0},{"$f":"IF(AND($F15<>\"\",$G15<>\"\"),$F$9*$F15/(1-$H$9*$G15),\"\")","v":0},null,{"$f":"IF(AND(J15<>\"\",Z15<>\"\"),J15-Z15,\"\")","v":6.3503649635036491E-2},{"$f":"IF(AND(K15<>\"\",AA15<>\"\"),K15-AA15,\"\")","v":4.6524064171123009E-2},2.6470588235294117E-2,2.4812030075187973E-2,1.935483870967742E-2,{"$f":"IF(AND(O15<>\"\",AE15<>\"\"),O15-AE15,\"\")","v":0.30293715083798883},{"$f":"IF(AND(P15<>\"\",AF15<>\"\"),P15-AF15,\"\")","v":0.33558273556231011},0.33952230769230768,0.24492450160771703,0.33396428571428571,null,{"$f":"IF(J15<>\"\", J15/$E$5,\"\")","v":7.4710176041219406E-2},{"$f":"IF(K15<>\"\", K15/$E$6,\"\")","v":6.121587390937238E-2},{"$f":"IF(L15<>\"\", L15/$E$7,\"\")","v":4.4865403788634101E-2},{"$f":"IF(M15<>\"\", M15/$E$8,\"\")","v":7.7537593984962419E-2},{"$f":"IF(N15<>\"\", N15/$E$9,\"\")","v":3.5190615835777123E-2},{"$f":"IF(O15<>\"\", O15/$E$5,\"\")","v":0.35639664804469273},{"$f":"IF(P15<>\"\", P15/$E$6,\"\")","v":0.44155623100303959},{"$f":"IF(Q15<>\"\", Q15/$E$7,\"\")","v":0.57546153846153847},{"$f":"IF(R15<>\"\", R15/$E$8,\"\")","v":0.76538906752411573},{"$f":"IF(S15<>\"\", S15/$E$9,\"\")","v":0.6072077922077922},{"$f":"IF(T15<>\"\", T15/$E$5,\"\")","v":0.26693181818181816},{"$f":"IF(U15<>\"\", U15/$E$6,\"\")","v":0.23003389830508481},{"$f":"IF(V15<>\"\", V15/$E$7,\"\")","v":0.1677142857142857},{"$f":"IF(W15<>\"\", W15/$E$8,\"\")","v":0.20819512195121956},{"$f":"IF(X15<>\"\", X15/$E$9,\"\")","v":0.12947368421052632}]
[null,{"$f":"'Solar prot device - data'!B16","v":2},{"$f":"IF('Solar prot device - data'!C16<>\"\",\"Glazing\"&\" + \"&'Solar prot device - data'!C16,\"\")","v":"Glazing + Opaque - Pastel"},null,null,{"$f":"IF('Solar prot device - data'!D16<>\"\",'Solar prot device - data'!D16,\"\")","v":0},{"$f":"IF('Solar prot device - data'!E16<>\"\",'Solar prot device - data'!E16,\"\")","v":0.5},{"$f":"IF('Solar prot device - data'!F16<>\"\",'Solar prot device - data'!F16,\"\")","v":0.5},{"$f":"IF('Solar prot device - data'!G16<>\"\",'Solar prot device - data'!G16,\"\")","v":0.5},{"$f":"IF(AND($F16<>\"\",$G16<>\"\"),$F16*BM$4+$I16*BM$9/BM$6+$F16*(1-BM$4)*BM$9/BM$5,\"\")","v":0.10583941605839416},{"$f":"IF(AND($F16<>\"\",$G16<>\"\"),$F16*BN$4+$I16*BN$9/BN$6+$F16*(1-BN$4)*BN$9/BN$5,\"\")","v":7.7540106951871662E-2},{"$f":"IF(AND($F16<>\"\",$G16<>\"\"),$F16*BO$4+$I16*BO$9/BO$6+$F16*(1-BO$4)*BO$9/BO$5,\"\")","v":4.4117647058823525E-2},{"$f":"IF(AND($F16<>\"\",$G16<>\"\"),$F16*BP$4+$I16*BP$9/BP$6+$F16*(1-BP$4)*BP$9/BP$5,\"\")","v":4.1353383458646614E-2},{"$f":"IF(AND($F16<>\"\",$G16<>\"\"),$F16*BQ$4+$I16*BQ$9/BQ$6+$F16*(1-BQ$4)*BQ$9/BQ$5,\"\")","v":3.2258064516129031E-2},{"$f":"IF(AND($F16<>\"\",$G16<>\"\"),BM$4*(1-BM$4*$G16-$I16*BM$10/BM$7),\"\")","v":0.41989525139664802},{"$f":"IF(AND($F16<>\"\",$G16<>\"\"),BN$4*(1-BN$4*$G16-$I16*BN$10/BN$7),\"\")","v":0.43770455927051671},{"$f":"IF(AND($F16<>\"\",$G16<>\"\"),BO$4*(1-BO$4*$G16-$I16*BO$10/BO$7),\"\")","v":0.40460384615384615},{"$f":"IF(AND($F16<>\"\",$G16<>\"\"),BP$4*(1-BP$4*$G16-$I16*BP$10/BP$7),\"\")","v":0.2631408360128617},{"$f":"IF(AND($F16<>\"\",$G16<>\"\"),BQ$4*(1-BQ$4*$G16-$I16*BQ$10/BQ$7),\"\")","v":0.39160714285714288},{"$f":"IF(AND($F16<>\"\",$G16<>\"\"),BM$4*$F16+BM$4*($I16+(1-BM$4)*$G16)*BM$11/BM$8,\"\")","v":0.32213068181818177},{"$f":"IF(AND($F16<>\"\",$G16<>\"\"),BN$4*$F16+BN$4*($I16+(1-BN$4)*$G16)*BN$11/BN$8,\"\")","v":0.23160677966101695},{"$f":"IF(AND($F16<>\"\",$G16<>\"\"),BO$4*$F16+BO$4*($I16+(1-BO$4)*$G16)*BO$11/BO$8,\"\")","v":0.11884285714285715},{"$f":"IF(AND($F16<>\"\",$G16<>\"\"),BP$4*$F16+BP$4*($I16+(1-BP$4)*$G16)*BP$11/BP$8,\"\")","v":7.211707317073171E-2},{"$f":"IF(AND($F16<>\"\",$G16<>\"\"),BQ$4*$F16+BQ$4*($I16+(1-BQ$4)*$G16)*BQ$11/BQ$8,\"\")","v":8.3947368421052646E-2},null,{"$f":"IF(AND($F16<>\"\",$H16<>\"\"),$F$5*$F16/(1-$G$5*$H16),\"\")","v":0},{"$f":"IF(AND($F16<>\"\",$H16<>\"\"),$F$6*$F16/(1-$G$6*$H16),\"\")","v":0},{"$f":"IF(AND($F16<>\"\",$H16<>\"\"),$F$7*$F16/(1-$G$7*$H16),\"\")","v":0},{"$f":"IF(AND($F16<>\"\",$H16<>\"\"),$F$8*$F16/(1-$G$8*$H16),\"\")","v":0},{"$f":"IF(AND($F16<>\"\",$H16<>\"\"),$F$9*$F16/(1-$G$9*$H16),\"\")","v":0},{"$f":"IF(AND($F16<>\"\",$G16<>\"\"),$F$5*$F16/(1-$H$5*$G16),\"\")","v":0},{"$f":"IF(AND($F16<>\"\",$G16<>\"\"),$F$6*$F16/(1-$H$6*$G16),\"\")","v":0},{"$f":"IF(AND($F16<>\"\",$G16<>\"\"),$F$7*$F16/(1-$H$7*$G16),\"\")","v":0},{"$f":"IF(AND($F16<>\"\",$G16<>\"\"),$F$8*$F16/(1-$H$8*$G16),\"\")","v":0},{"$f":"IF(AND($F16<>\"\",$G16<>\"\"),$F$9*$F16/(1-$H$9*$G16),\"\")","v":0},null,{"$f":"IF(AND(J16<>\"\",Z16<>\"\"),J16-Z16,\"\")","v":0.10583941605839416},{"$f":"IF(AND(K16<>\"\",AA16<>\"\"),K16-AA16,\"\")","v":7.7540106951871662E-2},{"$f":"IF(AND(L16<>\"\",AB16<>\"\"),L16-AB16,\"\")","v":4.4117647058823525E-2},{"$f":"IF(AND(M16<>\"\",AC16<>\"\"),M16-AC16,\"\")","v":4.1353383458646614E-2},{"$f":"IF(AND(N16<>\"\",AD16<>\"\"),N16-AD16,\"\")","v":3.2258064516129031E-2},{"$f":"IF(AND(O16<>\"\",AE16<>\"\"),O16-AE16,\"\")","v":0.41989525139664802},{"$f":"IF(AND(P16<>\"\",AF16<>\"\"),P16-AF16,\"\")","v":0.43770455927051671},{"$f":"IF(AND(Q16<>\"\",AG16<>\"\"),Q16-AG16,\"\")","v":0.40460384615384615},{"$f":"IF(AND(R16<>\"\",AH16<>\"\"),R16-AH16,\"\")","v":0.2631408360128617},{"$f":"IF(AND(S16<>\"\",AI16<>\"\"),S16-AI16,\"\")","v":0.39160714285714288},null,{"$f":"IF(J16<>\"\", J16/$E$5,\"\")","v":0.12451696006869901},{"$f":"IF(K16<>\"\", K16/$E$6,\"\")","v":0.1020264565156206},{"$f":"IF(L16<>\"\", L16/$E$7,\"\")","v":7.477567298105682E-2},{"$f":"IF(M16<>\"\", M16/$E$8,\"\")","v":0.12922932330827067},{"$f":"IF(N16<>\"\", N16/$E$9,\"\")","v":5.8651026392961873E-2},{"$f":"IF(O16<>\"\", O16/$E$5,\"\")","v":0.49399441340782119},{"$f":"IF(P16<>\"\", P16/$E$6,\"\")","v":0.57592705167173253},{"$f":"IF(Q16<>\"\", Q16/$E$7,\"\")","v":0.6857692307692308},{"$f":"IF(R16<>\"\", R16/$E$8,\"\")","v":0.82231511254019285},{"$f":"IF(S16<>\"\", S16/$E$9,\"\")","v":0.71201298701298699},{"$f":"IF(T16<>\"\", T16/$E$5,\"\")","v":0.37897727272727266},{"$f":"IF(U16<>\"\", U16/$E$6,\"\")","v":0.30474576271186438},{"$f":"IF(V16<>\"\", V16/$E$7,\"\")","v":0.20142857142857146},{"$f":"IF(W16<>\"\", W16/$E$8,\"\")","v":0.22536585365853659},{"$f":"IF(X16<>\"\", X16/$E$9,\"\")","v":0.15263157894736842}]
[null,{"$f":"'Solar prot device - data'!B17","v":3},{"$f":"IF('Solar prot device - data'!C17<>\"\",\"Glazing\"&\" + \"&'Solar prot device - data'!C17,\"\")","v":"Glazing + Opaque - Dark"},null,null,{"$f":"IF('Solar prot device - data'!D17<>\"\",'Solar prot device - data'!D17,\"\")","v":0},{"$f":"IF('Solar prot device - data'!E17<>\"\",'Solar prot device - data'!E17,\"\")","v":0.3},{"$f":"IF('Solar prot device - data'!F17<>\"\",'Solar prot device - data'!F17,\"\")","v":0.3},{"$f":"IF('Solar prot device - data'!G17<>\"\",'Solar prot device - data'!G17,\"\")","v":0.7},0.14817518248175182,0.10855614973262033,6.176470588235293E-2,5.7894736842105256E-2,4.5161290322580636E-2,0.53685335195530726,0.53982638297872343,0.46968538461538456,0.28135717041800645,0.44925000000000004,0.41736931818181811,0.28838779661016944,0.1387342857142857,7.7611707317073161E-2,9.6684210526315803E-2,null,0,0,0,0,0,0,0,0,0,0,null,0.14817518248175182,0.10855614973262033,6.176470588235293E-2,5.7894736842105256E-2,4.5161290322580636E-2,0.53685335195530726,0.53982638297872343,0.46968538461538456,0.28135717041800645,0.44925000000000004,null,0.17432374409617862,0.14283703912186885,0.10468594217347955,0.18092105263157893,8.211143695014661E-2,0.63159217877094975,0.71029787234042552,0.79607692307692302,0.87924115755627019,0.81681818181818178,0.49102272727272722,0.379457627118644,0.23514285714285713,0.24253658536585362,0.17578947368421052]
[null,{"$f":"'Solar prot device - data'!B18","v":4},{"$f":"IF('Solar prot device - data'!C18<>\"\",\"Glazing\"&\" + \"&'Solar prot device - data'!C18,\"\")","v":"Glazing + Opaque - Black"},null,null,{"$f":"IF('Solar prot device - data'!D18<>\"\",'Solar prot device - data'!D18,\"\")","v":0},{"$f":"IF('Solar prot device - data'!E18<>\"\",'Solar prot device - data'!E18,\"\")","v":0.1},{"$f":"IF('Solar prot device - data'!F18<>\"\",'Solar prot device - data'!F18,\"\")","v":0.1},{"$f":"IF('Solar prot device - data'!G18<>\"\",'Solar prot device - data'!G18,\"\")","v":0.9},0.1905109489051095,0.139572192513369,7.9411764705882334E-2,7.4436090225563911E-2,5.8064516129032261E-2,0.65381145251396655,0.64194820668693009,0.53476692307692308,0.29957350482315109,0.50689285714285715,0.51260795454545449,0.34516881355932211,0.15862571428571426,8.3106341463414626E-2,0.10942105263157897,null,0,0,0,0,0,0,0,0,0,0,null,0.1905109489051095,0.139572192513369,7.9411764705882334E-2,7.4436090225563911E-2,5.8064516129032261E-2,0.65381145251396655,0.64194820668693009,0.53476692307692308,0.29957350482315109,0.50689285714285715,null,0.22413052812365825,0.18364762172811711,0.13459621136590227,0.23261278195488722,0.10557184750733137,0.76918994413407826,0.84466869300911851,0.90638461538461546,0.9361672025723472,0.92162337662337657,0.60306818181818178,0.4541694915254238,0.26885714285714285,0.25970731707317068,0.19894736842105268]
[null,{"$f":"'Solar prot device - data'!B19","v":5},{"$f":"IF('Solar prot device - data'!C19<>\"\",\"Glazing\"&\" + \"&'Solar prot device - data'!C19,\"\")","v":"Glazing + Medium translucent - White"},null,null,{"$f":"IF('Solar prot device - data'!D19<>\"\",'Solar prot device - data'!D19,\"\")","v":0.2},{"$f":"IF('Solar prot device - data'!E19<>\"\",'Solar prot device - data'!E19,\"\")","v":0.6},{"$f":"IF('Solar prot device - data'!F19<>\"\",'Solar prot device - data'!F19,\"\")","v":0.6},{"$f":"IF('Solar prot device - data'!G19<>\"\",'Solar prot device - data'!G19,\"\")","v":0.20000000000000007},0.22503649635036499,0.19790374331550806,0.15011764705882352,0.1030375939849624,0.13451612903225807,0.3889581005586592,0.40004182370820668,0.37660153846153849,0.25629633440514471,0.36564285714285716,0.33246590909090912,0.28050440677966104,0.19318285714285716,0.1161990243902439,0.16442105263157897,null,0.17436974789915968,0.1506550218340611,0.11864406779661016,6.5375302663438259E-2,0.1152073732718894,0.17436974789915968,0.1506550218340611,0.11694510739856803,6.9948186528497422E-2,0.11600928074245941,null,5.0666748451205307E-2,4.7248721481446959E-2,3.1473579262213364E-2,3.7662291321524141E-2,1.9308755760368668E-2,0.21458835265949952,0.24938680187414558,0.25965643106297043,0.18634814787664727,0.24963357640039774,null,0.26474881923572352,0.26039966225724742,0.25443668993020935,0.3219924812030075,0.24457478005865102,0.45759776536312846,0.52637082066869301,0.63830769230769235,0.80092604501607723,0.66480519480519473,0.39113636363636367,0.36908474576271189,0.32742857142857146,0.36312195121951218,0.29894736842105263]
[null,{"$f":"'Solar prot device - data'!B20","v":6},{"$f":"IF('Solar prot device - data'!C20<>\"\",\"Glazing\"&\" + \"&'Solar prot device - data'!C20,\"\")","v":"Glazing + Medium translucent - Pastel"},null,null,{"$f":"IF('Solar prot device - data'!D20<>\"\",'Solar prot device - data'!D20,\"\")","v":0.2},{"$f":"IF('Solar prot device - data'!E20<>\"\",'Solar prot device - data'!E20,\"\")","v":0.4},{"$f":"IF('Solar prot device - data'!F20<>\"\",'Solar prot device - data'!F20,\"\")","v":0.4},{"$f":"IF('Solar prot device - data'!G20<>\"\",'Solar prot device - data'!G20,\"\")","v":0.4},0.26737226277372267,0.22891978609625671,0.16776470588235293,0.11957894736842106,0.14741935483870972,0.50591620111731828,0.50216364741641339,0.44168307692307696,0.27451266881028941,0.42328571428571432,0.42770454545454539,0.33728542372881365,0.21307428571428572,0.12169365853658537,0.17715789473684213,null,0.17148760330578514,0.1461864406779661,0.11085972850678734,6.1085972850678738E-2,0.10964912280701755,0.17148760330578514,0.1461864406779661,0.10986547085201794,6.3679245283018882E-2,0.11013215859030838,null,9.5884659467937533E-2,8.273334541829061E-2,5.6904977375565588E-2,5.8492974517742324E-2,3.7770232031692164E-2,0.33442859781153311,0.35597720673844729,0.33181760607105903,0.21083342352727052,0.31315355569540593,null,0.31455560326320314,0.30121024486349568,0.28434695912263208,0.37368421052631579,0.26803519061583581,0.59519553072625686,0.660741641337386,0.74861538461538468,0.85785209003215435,0.76961038961038963,0.50318181818181817,0.44379661016949162,0.36114285714285715,0.38029268292682927,0.32210526315789473]
[null,{"$f":"'Solar prot device - data'!B21","v":7},{"$f":"IF('Solar prot device - data'!C21<>\"\",\"Glazing\"&\" + \"&'Solar prot device - data'!C21,\"\")","v":"Glazing + Medium translucent - Dark"},null,null,{"$f":"IF('Solar prot device - data'!D21<>\"\",'Solar prot device - data'!D21,\"\")","v":0.2},{"$f":"IF('Solar prot device - data'!E21<>\"\",'Solar prot device - data'!E21,\"\")","v":0.2},{"$f":"IF('Solar prot device - data'!F21<>\"\",'Solar prot device - data'!F21,\"\")","v":0.2},{"$f":"IF('Solar prot device - data'!G21<>\"\",'Solar prot device - data'!G21,\"\")","v":0.60000000000000009},0.30970802919708029,0.25993582887700539,0.18541176470588236,0.1361203007518797,0.16032258064516131,0.62287430167597768,0.60428547112462005,0.50676461538461537,0.2927290032154341,0.48092857142857148,0.52294318181818189,0.39406644067796615,0.23296571428571428,0.12718829268292686,0.18989473684210528,null,0.16869918699186992,0.1419753086419753,0.1040339702760085,5.7324840764331218E-2,0.10460251046025106,0.16869918699186992,0.1419753086419753,0.10359408033826639,5.8441558441558454E-2,0.10482180293501049,null,0.14100884220521037,0.11796052023503009,8.1377794429873862E-2,7.8795459987548472E-2,5.572007018491025E-2,0.45417511468410776,0.46231016248264478,0.40317053504634898,0.23428744477387564,0.37610676849356101,null,0.36436238729068271,0.34202082746974394,0.31425722831505487,0.42537593984962402,0.29149560117302054,0.73279329608938548,0.79511246200607899,0.8589230769230769,0.91477813504823158,0.87441558441558442,0.61522727272727284,0.51850847457627125,0.39485714285714285,0.39746341463414642,0.34526315789473683]
[null,{"$f":"'Solar prot device - data'!B22","v":8},{"$f":"IF('Solar prot device - data'!C22<>\"\",\"Glazing\"&\" + \"&'Solar prot device - data'!C22,\"\")","v":"Glazing + Medium translucent - Black"},null,null,{"$f":"IF('Solar prot device - data'!D22<>\"\",'Solar prot device - data'!D22,\"\")","v":0.2},{"$f":"IF('Solar prot device - data'!E22<>\"\",'Solar prot device - data'!E22,\"\")","v":0.1},{"$f":"IF('Solar prot device - data'!F22<>\"\",'Solar prot device - data'!F22,\"\")","v":0.1},{"$f":"IF('Solar prot device - data'!G22<>\"\",'Solar prot device - data'!G22,\"\")","v":0.70000000000000007},0.33087591240875913,0.27544385026737972,0.19423529411764706,0.14439097744360901,0.16677419354838713,0.68135335195530733,0.65534638297872339,0.53930538461538458,0.3018371704180064,0.50975000000000004,0.57056249999999997,0.42245694915254245,0.24291142857142856,0.12993560975609758,0.19626315789473689,null,0.16733870967741937,0.13995943204868153,0.10092687950566427,5.561277033985583E-2,0.10224948875255624,0.16733870967741937,0.13995943204868153,0.10071942446043167,5.6133056133056143E-2,0.10235414534288639,null,0.16353720273133976,0.13548441821869819,9.330841461198279E-2,8.8778207103753184E-2,6.4524704795830889E-2,0.51401464227788796,0.51538695093004183,0.43858596015495288,0.24570411428495026,0.40739585465711364,null,0.38926577930442252,0.36242611877286807,0.32921236291126621,0.45122180451127814,0.30322580645161296,0.80159217877094979,0.86229787234042554,0.91407692307692301,0.94324115755626992,0.92681818181818176,0.67125000000000001,0.55586440677966109,0.4117142857142857,0.40604878048780491,0.35684210526315796]
[null,{"$f":"'Solar prot device - data'!B23","v":9},{"$f":"IF('Solar prot device - data'!C23<>\"\",\"Glazing\"&\" + \"&'Solar prot device - data'!C23,\"\")","v":"Glazing + High translucent - White"},null,null,{"$f":"IF('Solar prot device - data'!D23<>\"\",'Solar prot device - data'!D23,\"\")","v":0.4},{"$f":"IF('Solar prot device - data'!E23<>\"\",'Solar prot device - data'!E23,\"\")","v":0.4},{"$f":"IF('Solar prot device - data'!F23<>\"\",'Solar prot device - data'!F23,\"\")","v":0.4},{"$f":"IF('Solar prot device - data'!G23<>\"\",'Solar prot device - data'!G23,\"\")","v":0.19999999999999996},0.40773722627737224,0.36479144385026741,0.28258823529411764,0.18953383458646617,0.25612903225806455,0.53345810055865917,0.51556182370820658,0.44622153846153845,0.27677633440514471,0.42614285714285721,0.48565909090909087,0.41457355932203394,0.29735999999999996,0.16852292682926828,0.26400000000000001,null,0.34297520661157027,0.2923728813559322,0.22171945701357468,0.12217194570135748,0.2192982456140351,0.34297520661157027,0.2923728813559322,0.21973094170403587,0.12735849056603776,0.22026431718061676,null,6.4762019665801973E-2,7.2418562494335204E-2,6.0868778280542962E-2,6.7361888885108689E-2,3.6830786644029445E-2,0.19048289394708889,0.22318894235227438,0.22649059675750258,0.14941784383910695,0.20587853996224045,null,0.47969085444396736,0.47998874190824659,0.47896311066799602,0.59229323308270676,0.46568914956011731,0.6275977653631285,0.67837082066869281,0.75630769230769235,0.86492604501607717,0.77480519480519483,0.5713636363636363,0.54549152542372881,0.504,0.52663414634146333,0.48]
[null,{"$f":"'Solar prot device - data'!B24","v":10},{"$f":"IF('Solar prot device - data'!C24<>\"\",\"Glazing\"&\" + \"&'Solar prot device - data'!C24,\"\")","v":"Glazing + High translucent - Pastel"},null,null,{"$f":"IF('Solar prot device - data'!D24<>\"\",'Solar prot device - data'!D24,\"\")","v":0.4},{"$f":"IF('Solar prot device - data'!E24<>\"\",'Solar prot device - data'!E24,\"\")","v":0.3},{"$f":"IF('Solar prot device - data'!F24<>\"\",'Solar prot device - data'!F24,\"\")","v":0.3},{"$f":"IF('Solar prot device - data'!G24<>\"\",'Solar prot device - data'!G24,\"\")","v":0.3},0.42890510948905108,0.38029946524064173,0.29141176470588237,0.19780451127819548,0.26258064516129032,0.59193715083798881,0.56662273556231013,0.47876230769230765,0.28588450160771706,0.45496428571428571,0.53327840909090907,0.44296406779661024,0.30730571428571429,0.17127024390243903,0.27036842105263159,null,0.34016393442622955,0.2881002087682672,0.21467688937568455,0.11829134720700987,0.21413276231263387,0.34016393442622955,0.2881002087682672,0.21327529923830249,0.12189616252821672,0.21482277121374865,null,8.8741175062821531E-2,9.2199256472374536E-2,7.6734875330197821E-2,7.951316407118561E-2,4.8447882848656448E-2,0.25177321641175926,0.27852252679404294,0.26548700845400519,0.16398833907950033,0.24014151450053706,null,0.50459424645770712,0.50039403321137066,0.49391824526420741,0.61813909774436082,0.47741935483870962,0.6963966480446927,0.74555623100303969,0.81146153846153846,0.89338906752411573,0.82720779220779217,0.62738636363636358,0.58284745762711876,0.52085714285714291,0.53521951219512198,0.49157894736842106]
[null,{"$f":"'Solar prot device - data'!B25","v":11},{"$f":"IF('Solar prot device - data'!C25<>\"\",\"Glazing\"&\" + \"&'Solar prot device - data'!C25,\"\")","v":"Glazing + High translucent - Dark"},null,null,{"$f":"IF('Solar prot device - data'!D25<>\"\",'Solar prot device - data'!D25,\"\")","v":0.4},{"$f":"IF('Solar prot device - data'!E25<>\"\",'Solar prot device - data'!E25,\"\")","v":0.2},{"$f":"IF('Solar prot device - data'!F25<>\"\",'Solar prot device - data'!F25,\"\")","v":0.2},{"$f":"IF('Solar prot device - data'!G25<>\"\",'Solar prot device - data'!G25,\"\")","v":0.39999999999999997},0.45007299270072992,0.39580748663101606,0.30023529411764704,0.2060751879699248,0.26903225806451614,0.65041620111731846,0.61768364741641335,0.51130307692307697,0.2949926688102894,0.48378571428571432,0.58089772727272726,0.47135457627118649,0.31725142857142852,0.17401756097560975,0.27673684210526317,null,0.33739837398373984,0.2839506172839506,0.20806794055201699,0.11464968152866244,0.20920502092050211,0.33739837398373984,0.2839506172839506,0.20718816067653278,0.11688311688311691,0.20964360587002098,null,0.11267461871699008,0.11185686934706546,9.216735356563005E-2,9.1425506441262364E-2,5.9827237144014028E-2,0.31301782713357862,0.33373303013246275,0.30411491624654419,0.17810955192717248,0.27414210841569331,null,0.52949763847144693,0.52079932451449484,0.5088733798604187,0.64398496240601499,0.48914956011730204,0.76519553072625701,0.81274164133738602,0.86661538461538479,0.9218520900321544,0.87961038961038962,0.68340909090909097,0.62020338983050849,0.5377142857142857,0.54380487804878042,0.50315789473684214]
[null,{"$f":"'Solar prot device - data'!B26","v":12},{"$f":"IF('Solar prot device - data'!C26<>\"\",\"Glazing\"&\" + \"&'Solar prot device - data'!C26,\"\")","v":"Glazing + High translucent - Black"},null,null,{"$f":"IF('Solar prot device - data'!D26<>\"\",'Solar prot device - data'!D26,\"\")","v":0.4},{"$f":"IF('Solar prot device - data'!E26<>\"\",'Solar prot device - data'!E26,\"\")","v":0.1},{"$f":"IF('Solar prot device - data'!F26<>\"\",'Solar prot device - data'!F26,\"\")","v":0.1},{"$f":"IF('Solar prot device - data'!G26<>\"\",'Solar prot device - data'!G26,\"\")","v":0.5},0.47124087591240876,0.41131550802139039,0.30905882352941177,0.21434586466165412,0.27548387096774196,0.708895251396648,0.66874455927051668,0.54384384615384618,0.3041008360128617,0.51260714285714282,0.62851704545454545,0.49974508474576274,0.32719714285714285,0.17676487804878049,0.2831052631578948,null,0.33467741935483875,0.27991886409736305,0.20185375901132854,0.11122554067971166,0.20449897750511248,0.33467741935483875,0.27991886409736305,0.20143884892086333,0.11226611226611229,0.20470829068577279,null,0.13656345655757002,0.13139664392402733,0.10720506451808323,0.10312032398194246,7.0984893462629484E-2,0.37421783204180925,0.38882569517315363,0.34240499723298284,0.19183472374674942,0.30789885217137003,null,0.55440103048518674,0.54120461581761892,0.52382851445663015,0.66983082706766905,0.50087976539589441,0.83399441340782121,0.87992705167173246,0.9217692307692309,0.95031511254019274,0.93201298701298685,0.73943181818181825,0.65755932203389833,0.5545714285714286,0.55239024390243907,0.51473684210526327]
[null,{"$f":"'Solar prot device - data'!B27","v":13},{"$f":"IF('Solar prot device - data'!C27<>\"\",\"Glazing\"&\" + \"&'Solar prot device - data'!C27,\"\")","v":""},null,null,{"$f":"IF('Solar prot device - data'!D27<>\"\",'Solar prot device - data'!D27,\"\")","v":""},{"$f":"IF('Solar prot device - data'!E27<>\"\",'Solar prot device - data'!E27,\"\")","v":""},{"$f":"IF('Solar prot device - data'!F27<>\"\",'Solar prot device - data'!F27,\"\")","v":""},{"$f":"IF('Solar prot device - data'!G27<>\"\",'Solar prot device - data'!G27,\"\")","v":""},{"$f":"IF(AND($F27<>\"\",$G27<>\"\"),$F27*BM$4+$I27*BM$9/BM$6+$F27*(1-BM$4)*BM$9/BM$5,\"\")","v":""},{"$f":"IF(AND($F27<>\"\",$G27<>\"\"),$F27*BN$4+$I27*BN$9/BN$6+$F27*(1-BN$4)*BN$9/BN$5,\"\")","v":""},{"$f":"IF(AND($F27<>\"\",$G27<>\"\"),$F27*BO$4+$I27*BO$9/BO$6+$F27*(1-BO$4)*BO$9/BO$5,\"\")","v":""},{"$f":"IF(AND($F27<>\"\",$G27<>\"\"),$F27*BP$4+$I27*BP$9/BP$6+$F27*(1-BP$4)*BP$9/BP$5,\"\")","v":""},{"$f":"IF(AND($F27<>\"\",$G27<>\"\"),$F27*BQ$4+$I27*BQ$9/BQ$6+$F27*(1-BQ$4)*BQ$9/BQ$5,\"\")","v":""},{"$f":"IF(AND($F27<>\"\",$G27<>\"\"),BM$4*(1-BM$4*$G27-$I27*BM$10/BM$7),\"\")","v":""},{"$f":"IF(AND($F27<>\"\",$G27<>\"\"),BN$4*(1-BN$4*$G27-$I27*BN$10/BN$7),\"\")","v":""},{"$f":"IF(AND($F27<>\"\",$G27<>\"\"),BO$4*(1-BO$4*$G27-$I27*BO$10/BO$7),\"\")","v":""},{"$f":"IF(AND($F27<>\"\",$G27<>\"\"),BP$4*(1-BP$4*$G27-$I27*BP$10/BP$7),\"\")","v":""},{"$f":"IF(AND($F27<>\"\",$G27<>\"\"),BQ$4*(1-BQ$4*$G27-$I27*BQ$10/BQ$7),\"\")","v":""},{"$f":"IF(AND($F27<>\"\",$G27<>\"\"),BM$4*$F27+BM$4*($I27+(1-BM$4)*$G27)*BM$11/BM$8,\"\")","v":""},{"$f":"IF(AND($F27<>\"\",$G27<>\"\"),BN$4*$F27+BN$4*($I27+(1-BN$4)*$G27)*BN$11/BN$8,\"\")","v":""},{"$f":"IF(AND($F27<>\"\",$G27<>\"\"),BO$4*$F27+BO$4*($I27+(1-BO$4)*$G27)*BO$11/BO$8,\"\")","v":""},{"$f":"IF(AND($F27<>\"\",$G27<>\"\"),BP$4*$F27+BP$4*($I27+(1-BP$4)*$G27)*BP$11/BP$8,\"\")","v":""},{"$f":"IF(AND($F27<>\"\",$G27<>\"\"),BQ$4*$F27+BQ$4*($I27+(1-BQ$4)*$G27)*BQ$11/BQ$8,\"\")","v":""},null,"","","","","","","","","","",null,{"$f":"IF(AND(J27<>\"\",Z27<>\"\"),J27-Z27,\"\")","v":""},{"$f":"IF(AND(K27<>\"\",AA27<>\"\"),K27-AA27,\"\")","v":""},{"$f":"IF(AND(L27<>\"\",AB27<>\"\"),L27-AB27,\"\")","v":""},{"$f":"IF(AND(M27<>\"\",AC27<>\"\"),M27-AC27,\"\")","v":""},{"$f":"IF(AND(N27<>\"\",AD27<>\"\"),N27-AD27,\"\")","v":""},{"$f":"IF(AND(O27<>\"\",AE27<>\"\"),O27-AE27,\"\")","v":""},{"$f":"IF(AND(P27<>\"\",AF27<>\"\"),P27-AF27,\"\")","v":""},{"$f":"IF(AND(Q27<>\"\",AG27<>\"\"),Q27-AG27,\"\")","v":""},{"$f":"IF(AND(R27<>\"\",AH27<>\"\"),R27-AH27,\"\")","v":""},{"$f":"IF(AND(S27<>\"\",AI27<>\"\"),S27-AI27,\"\")","v":""},null,{"$f":"IF(J27<>\"\", J27/$E$5,\"\")","v":""},{"$f":"IF(K27<>\"\", K27/$E$6,\"\")","v":""},{"$f":"IF(L27<>\"\", L27/$E$7,\"\")","v":""},{"$f":"IF(M27<>\"\", M27/$E$8,\"\")","v":""},{"$f":"IF(N27<>\"\", N27/$E$9,\"\")","v":""},{"$f":"IF(O27<>\"\", O27/$E$5,\"\")","v":""},{"$f":"IF(P27<>\"\", P27/$E$6,\"\")","v":""},{"$f":"IF(Q27<>\"\", Q27/$E$7,\"\")","v":""},{"$f":"IF(R27<>\"\", R27/$E$8,\"\")","v":""},{"$f":"IF(S27<>\"\", S27/$E$9,\"\")","v":""},{"$f":"IF(T27<>\"\", T27/$E$5,\"\")","v":""},{"$f":"IF(U27<>\"\", U27/$E$6,\"\")","v":""},{"$f":"IF(V27<>\"\", V27/$E$7,\"\")","v":""},{"$f":"IF(W27<>\"\", W27/$E$8,\"\")","v":""},{"$f":"IF(X27<>\"\", X27/$E$9,\"\")","v":""}]
[null,{"$f":"'Solar prot device - data'!B28","v":14},{"$f":"IF('Solar prot device - data'!C28<>\"\",\"Glazing\"&\" + \"&'Solar prot device - data'!C28,\"\")","v":""},null,null,{"$f":"IF('Solar prot device - data'!D28<>\"\",'Solar prot device - data'!D28,\"\")","v":""},{"$f":"IF('Solar prot device - data'!E28<>\"\",'Solar prot device - data'!E28,\"\")","v":""},{"$f":"IF('Solar prot device - data'!F28<>\"\",'Solar prot device - data'!F28,\"\")","v":""},{"$f":"IF('Solar prot device - data'!G28<>\"\",'Solar prot device - data'!G28,\"\")","v":""},"","","","","","","","","","","","","","","",null,"","","","","","","","","","",null,"","","","","","","","","","",null,"","","","","","","","","","","","","","",""]
[null,{"$f":"'Solar prot device - data'!B29","v":15},{"$f":"IF('Solar prot device - data'!C29<>\"\",\"Glazing\"&\" + \"&'Solar prot device - data'!C29,\"\")","v":""},null,null,{"$f":"IF('Solar prot device - data'!D29<>\"\",'Solar prot device - data'!D29,\"\")","v":""},{"$f":"IF('Solar prot device - data'!E29<>\"\",'Solar prot device - data'!E29,\"\")","v":""},{"$f":"IF('Solar prot device - data'!F29<>\"\",'Solar prot device - data'!F29,\"\")","v":""},{"$f":"IF('Solar prot device - data'!G29<>\"\",'Solar prot device - data'!G29,\"\")","v":""},"","","","","","","","","","","","","","","",null,"","","","","","","","","","",null,"","","","","","","","","","",null,"","","","","","","","","","","","","","",""]
[null,{"$f":"'Solar prot device - data'!B30","v":16},{"$f":"IF('Solar prot device - data'!C30<>\"\",\"Glazing\"&\" + \"&'Solar prot device - data'!C30,\"\")","v":""},null,null,{"$f":"IF('Solar prot device - data'!D30<>\"\",'Solar prot device - data'!D30,\"\")","v":""},{"$f":"IF('Solar prot device - data'!E30<>\"\",'Solar prot device - data'!E30,\"\")","v":""},{"$f":"IF('Solar prot device - data'!F30<>\"\",'Solar prot device - data'!F30,\"\")","v":""},{"$f":"IF('Solar prot device - data'!G30<>\"\",'Solar prot device - data'!G30,\"\")","v":""},"","","","","","","","","","","","","","","",null,"","","","","","","","","","",null,"","","","","","","","","","",null,"","","","","","","","","","","","","","",""]
[null,{"$f":"'Solar prot device - data'!B31","v":17},{"$f":"IF('Solar prot device - data'!C31<>\"\",\"Glazing\"&\" + \"&'Solar prot device - data'!C31,\"\")","v":""},null,null,{"$f":"IF('Solar prot device - data'!D31<>\"\",'Solar prot device - data'!D31,\"\")","v":""},{"$f":"IF('Solar prot device - data'!E31<>\"\",'Solar prot device - data'!E31,\"\")","v":""},{"$f":"IF('Solar prot device - data'!F31<>\"\",'Solar prot device - data'!F31,\"\")","v":""},{"$f":"IF('Solar prot device - data'!G31<>\"\",'Solar prot device - data'!G31,\"\")","v":""},"","","","","","","","","","","","","","","",null,"","","","","","","","","","",null,"","","","","","","","","","",null,"","","","","","","","","","","","","","",""]
[null,{"$f":"'Solar prot device - data'!B32","v":18},{"$f":"IF('Solar prot device - data'!C32<>\"\",\"Glazing\"&\" + \"&'Solar prot device - data'!C32,\"\")","v":""},null,null,{"$f":"IF('Solar prot device - data'!D32<>\"\",'Solar prot device - data'!D32,\"\")","v":""},{"$f":"IF('Solar prot device - data'!E32<>\"\",'Solar prot device - data'!E32,\"\")","v":""},{"$f":"IF('Solar prot device - data'!F32<>\"\",'Solar prot device - data'!F32,\"\")","v":""},{"$f":"IF('Solar prot device - data'!G32<>\"\",'Solar prot device - data'!G32,\"\")","v":""},"","","","","","","","","","","","","","","",null,"","","","","","","","","","",null,"","","","","","","","","","",null,"","","","","","","","","","","","","","",""]
[null,{"$f":"'Solar prot device - data'!B33","v":19},{"$f":"IF('Solar prot device - data'!C33<>\"\",\"Glazing\"&\" + \"&'Solar prot device - data'!C33,\"\")","v":""},null,null,{"$f":"IF('Solar prot device - data'!D33<>\"\",'Solar prot device - data'!D33,\"\")","v":""},{"$f":"IF('Solar prot device - data'!E33<>\"\",'Solar prot device - data'!E33,\"\")","v":""},{"$f":"IF('Solar prot device - data'!F33<>\"\",'Solar prot device - data'!F33,\"\")","v":""},{"$f":"IF('Solar prot device - data'!G33<>\"\",'Solar prot device - data'!G33,\"\")","v":""},"","","","","","","","","","","","","","","",null,"","","","","","","","","","",null,"","","","","","","","","","",null,"","","","","","","","","","","","","","",""]
[null,{"$f":"'Solar prot device - data'!B34","v":20},{"$f":"IF('Solar prot device - data'!C34<>\"\",\"Glazing\"&\" + \"&'Solar prot device - data'!C34,\"\")","v":""},null,null,{"$f":"IF('Solar prot device - data'!D34<>\"\",'Solar prot device - data'!D34,\"\")","v":""},{"$f":"IF('Solar prot device - data'!E34<>\"\",'Solar prot device - data'!E34,\"\")","v":""},{"$f":"IF('Solar prot device - data'!F34<>\"\",'Solar prot device - data'!F34,\"\")","v":""},{"$f":"IF('Solar prot device - data'!G34<>\"\",'Solar prot device - data'!G34,\"\")","v":""},"","","","","","","","","","","","","","","",null,"","","","","","","","","","",null,"","","","","","","","","","",null,"","","","","","","","","","","","","","",""]
[null,{"$f":"'Solar prot device - data'!B35","v":21},{"$f":"IF('Solar prot device - data'!C35<>\"\",\"Glazing\"&\" + \"&'Solar prot device - data'!C35,\"\")","v":""},null,null,{"$f":"IF('Solar prot device - data'!D35<>\"\",'Solar prot device - data'!D35,\"\")","v":""},{"$f":"IF('Solar prot device - data'!E35<>\"\",'Solar prot device - data'!E35,\"\")","v":""},{"$f":"IF('Solar prot device - data'!F35<>\"\",'Solar prot device - data'!F35,\"\")","v":""},{"$f":"IF('Solar prot device - data'!G35<>\"\",'Solar prot device - data'!G35,\"\")","v":""},"","","","","","","","","","","","","","","",null,"","","","","","","","","","",null,"","","","","","","","","","",null,"","","","","","","","","","","","","","",""]
[null,{"$f":"'Solar prot device - data'!B36","v":22},{"$f":"IF('Solar prot device - data'!C36<>\"\",\"Glazing\"&\" + \"&'Solar prot device - data'!C36,\"\")","v":""},null,null,{"$f":"IF('Solar prot device - data'!D36<>\"\",'Solar prot device - data'!D36,\"\")","v":""},{"$f":"IF('Solar prot device - data'!E36<>\"\",'Solar prot device - data'!E36,\"\")","v":""},{"$f":"IF('Solar prot device - data'!F36<>\"\",'Solar prot device - data'!F36,\"\")","v":""},{"$f":"IF('Solar prot device - data'!G36<>\"\",'Solar prot device - data'!G36,\"\")","v":""},"","","","","","","","","","","","","","","",null,"","","","","","","","","","",null,"","","","","","","","","","",null,"","","","","","","","","","","","","","",""]
[null,{"$f":"'Solar prot device - data'!B37","v":23},{"$f":"IF('Solar prot device - data'!C37<>\"\",\"Glazing\"&\" + \"&'Solar prot device - data'!C37,\"\")","v":""},null,null,{"$f":"IF('Solar prot device - data'!D37<>\"\",'Solar prot device - data'!D37,\"\")","v":""},{"$f":"IF('Solar prot device - data'!E37<>\"\",'Solar prot device - data'!E37,\"\")","v":""},{"$f":"IF('Solar prot device - data'!F37<>\"\",'Solar prot device - data'!F37,\"\")","v":""},{"$f":"IF('Solar prot device - data'!G37<>\"\",'Solar prot device - data'!G37,\"\")","v":""},"","","","","","","","","","","","","","","",null,"","","","","","","","","","",null,"","","","","","","","","","",null,"","","","","","","","","","","","","","",""]
[null,{"$f":"'Solar prot device - data'!B38","v":24},{"$f":"IF('Solar prot device - data'!C38<>\"\",\"Glazing\"&\" + \"&'Solar prot device - data'!C38,\"\")","v":""},null,null,null,{"$f":"IF('Solar prot device - data'!E38<>\"\",'Solar prot device - data'!E38,\"\")","v":""},{"$f":"IF('Solar prot device - data'!F38<>\"\",'Solar prot device - data'!F38,\"\")","v":""},{"$f":"IF('Solar prot device - data'!G38<>\"\",'Solar prot device - data'!G38,\"\")","v":""},"","","","","","","","","","","","","","","",null,"","","","","","","","","","",null,"","","","","","","","","","",null,"","","","","","","","","","","","","","",""]
[null,{"$f":"'Solar prot device - data'!B39","v":25},{"$f":"IF('Solar prot device - data'!C39<>\"\",\"Glazing\"&\" + \"&'Solar prot device - data'!C39,\"\")","v":""},null,null,null,{"$f":"IF('Solar prot device - data'!E39<>\"\",'Solar prot device - data'!E39,\"\")","v":""},{"$f":"IF('Solar prot device - data'!F39<>\"\",'Solar prot device - data'!F39,\"\")","v":""},{"$f":"IF('Solar prot device - data'!G39<>\"\",'Solar prot device - data'!G39,\"\")","v":""},"","","","","","","","","","","","","","","",null,"","","","","","","","","","",null,"","","","","","","","","","",null,"","","","","","","","","","","","","","",""]
[null,{"$f":"'Solar prot device - data'!B40","v":26},{"$f":"IF('Solar prot device - data'!C40<>\"\",\"Glazing\"&\" + \"&'Solar prot device - data'!C40,\"\")","v":""},null,null,{"$f":"IF('Solar prot device - data'!D40<>\"\",'Solar prot device - data'!D40,\"\")","v":""},{"$f":"IF('Solar prot device - data'!E40<>\"\",'Solar prot device - data'!E40,\"\")","v":""},{"$f":"IF('Solar prot device - data'!F40<>\"\",'Solar prot device - data'!F40,\"\")","v":""},{"$f":"IF('Solar prot device - data'!G40<>\"\",'Solar prot device - data'!G40,\"\")","v":""},"","","","","","","","","","","","","","","",null,"","","","","","","","","","",null,"","","","","","","","","","",null,"","","","","","","","","","","","","","",""]
[null,{"$f":"'Solar prot device - data'!B41","v":27},{"$f":"IF('Solar prot device - data'!C41<>\"\",\"Glazing\"&\" + \"&'Solar prot device - data'!C41,\"\")","v":""},null,null,{"$f":"IF('Solar prot device - data'!D41<>\"\",'Solar prot device - data'!D41,\"\")","v":""},{"$f":"IF('Solar prot device - data'!E41<>\"\",'Solar prot device - data'!E41,\"\")","v":""},{"$f":"IF('Solar prot device - data'!F41<>\"\",'Solar prot device - data'!F41,\"\")","v":""},{"$f":"IF('Solar prot device - data'!G41<>\"\",'Solar prot device - data'!G41,\"\")","v":""},"","","","","","","","","","","","","","","",null,"","","","","","","","","","",null,"","","","","","","","","","",null,"","","","","","","","","","","","","","",""]
[null,{"$f":"'Solar prot device - data'!B42","v":28},{"$f":"IF('Solar prot device - data'!C42<>\"\",\"Glazing\"&\" + \"&'Solar prot device - data'!C42,\"\")","v":""},null,null,{"$f":"IF('Solar prot device - data'!D42<>\"\",'Solar prot device - data'!D42,\"\")","v":""},{"$f":"IF('Solar prot device - data'!E42<>\"\",'Solar prot device - data'!E42,\"\")","v":""},{"$f":"IF('Solar prot device - data'!F42<>\"\",'Solar prot device - data'!F42,\"\")","v":""},{"$f":"IF('Solar prot device - data'!G42<>\"\",'Solar prot device - data'!G42,\"\")","v":""},"","","","","","","","","","","","","","","",null,"","","","","","","","","","",null,"","","","","","","","","","",null,"","","","","","","","","","","","","","",""]
[null,{"$f":"'Solar prot device - data'!B43","v":29},{"$f":"IF('Solar prot device - data'!C43<>\"\",\"Glazing\"&\" + \"&'Solar prot device - data'!C43,\"\")","v":""},null,null,{"$f":"IF('Solar prot device - data'!D43<>\"\",'Solar prot device - data'!D43,\"\")","v":""},{"$f":"IF('Solar prot device - data'!E43<>\"\",'Solar prot device - data'!E43,\"\")","v":""},{"$f":"IF('Solar prot device - data'!F43<>\"\",'Solar prot device - data'!F43,\"\")","v":""},{"$f":"IF('Solar prot device - data'!G43<>\"\",'Solar prot device - data'!G43,\"\")","v":""},"","","","","","","","","","","","","","","",null,"","","","","","","","","","",null,"","","","","","","","","","",null,"","","","","","","","","","","","","","",""]
[null,{"$f":"'Solar prot device - data'!B44","v":30},{"$f":"IF('Solar prot device - data'!C44<>\"\",\"Glazing\"&\" + \"&'Solar prot device - data'!C44,\"\")","v":""},null,null,{"$f":"IF('Solar prot device - data'!D44<>\"\",'Solar prot device - data'!D44,\"\")","v":""},{"$f":"IF('Solar prot device - data'!E44<>\"\",'Solar prot device - data'!E44,\"\")","v":""},{"$f":"IF('Solar prot device - data'!F44<>\"\",'Solar prot device - data'!F44,\"\")","v":""},{"$f":"IF('Solar prot device - data'!G44<>\"\",'Solar prot device - data'!G44,\"\")","v":""},"","","","","","","","","","","","","","","",null,"","","","","","","","","","",null,"","","","","","","","","","",null,"","","","","","","","","","","","","","",""]
[null,{"$f":"'Solar prot device - data'!B45","v":31},{"$f":"IF('Solar prot device - data'!C45<>\"\",\"Glazing\"&\" + \"&'Solar prot device - data'!C45,\"\")","v":""},null,null,{"$f":"IF('Solar prot device - data'!D45<>\"\",'Solar prot device - data'!D45,\"\")","v":""},{"$f":"IF('Solar prot device - data'!E45<>\"\",'Solar prot device - data'!E45,\"\")","v":""},{"$f":"IF('Solar prot device - data'!F45<>\"\",'Solar prot device - data'!F45,\"\")","v":""},{"$f":"IF('Solar prot device - data'!G45<>\"\",'Solar prot device - data'!G45,\"\")","v":""},"","","","","","","","","","","","","","","",null,"","","","","","","","","","",null,"","","","","","","","","","",null,"","","","","","","","","","","","","","",""]
[null,{"$f":"'Solar prot device - data'!B46","v":32},{"$f":"IF('Solar prot device - data'!C46<>\"\",\"Glazing\"&\" + \"&'Solar prot device - data'!C46,\"\")","v":""},null,null,{"$f":"IF('Solar prot device - data'!D46<>\"\",'Solar prot device - data'!D46,\"\")","v":""},{"$f":"IF('Solar prot device - data'!E46<>\"\",'Solar prot device - data'!E46,\"\")","v":""},{"$f":"IF('Solar prot device - data'!F46<>\"\",'Solar prot device - data'!F46,\"\")","v":""},{"$f":"IF('Solar prot device - data'!G46<>\"\",'Solar prot device - data'!G46,\"\")","v":""},"","","","","","","","","","","","","","","",null,"","","","","","","","","","",null,"","","","","","","","","","",null,"","","","","","","","","","","","","","",""]
[null,{"$f":"'Solar prot device - data'!B47","v":33},{"$f":"IF('Solar prot device - data'!C47<>\"\",\"Glazing\"&\" + \"&'Solar prot device - data'!C47,\"\")","v":""},null,null,{"$f":"IF('Solar prot device - data'!D47<>\"\",'Solar prot device - data'!D47,\"\")","v":""},{"$f":"IF('Solar prot device - data'!E47<>\"\",'Solar prot device - data'!E47,\"\")","v":""},{"$f":"IF('Solar prot device - data'!F47<>\"\",'Solar prot device - data'!F47,\"\")","v":""},{"$f":"IF('Solar prot device - data'!G47<>\"\",'Solar prot device - data'!G47,\"\")","v":""},"","","","","","","","","","","","","","","",null,"","","","","","","","","","",null,"","","","","","","","","","",null,"","","","","","","","","","","","","","",""]
[null,{"$f":"'Solar prot device - data'!B48","v":34},{"$f":"IF('Solar prot device - data'!C48<>\"\",\"Glazing\"&\" + \"&'Solar prot device - data'!C48,\"\")","v":""},null,null,{"$f":"IF('Solar prot device - data'!D48<>\"\",'Solar prot device - data'!D48,\"\")","v":""},{"$f":"IF('Solar prot device - data'!E48<>\"\",'Solar prot device - data'!E48,\"\")","v":""},{"$f":"IF('Solar prot device - data'!F48<>\"\",'Solar prot device - data'!F48,\"\")","v":""},{"$f":"IF('Solar prot device - data'!G48<>\"\",'Solar prot device - data'!G48,\"\")","v":""},"","","","","","","","","","","","","","","",null,"","","","","","","","","","",null,"","","","","","","","","","",null,"","","","","","","","","","","","","","",""]
[null,{"$f":"'Solar prot device - data'!B49","v":35},{"$f":"IF('Solar prot device - data'!C49<>\"\",\"Glazing\"&\" + \"&'Solar prot device - data'!C49,\"\")","v":""},null,null,{"$f":"IF('Solar prot device - data'!D49<>\"\",'Solar prot device - data'!D49,\"\")","v":""},{"$f":"IF('Solar prot device - data'!E49<>\"\",'Solar prot device - data'!E49,\"\")","v":""},{"$f":"IF('Solar prot device - data'!F49<>\"\",'Solar prot device - data'!F49,\"\")","v":""},{"$f":"IF('Solar prot device - data'!G49<>\"\",'Solar prot device - data'!G49,\"\")","v":""},"","","","","","","","","","","","","","","",null,"","","","","","","","","","",null,"","","","","","","","","","",null,"","","","","","","","","","","","","","",""]
[null,{"$f":"'Solar prot device - data'!B50","v":36},{"$f":"IF('Solar prot device - data'!C50<>\"\",\"Glazing\"&\" + \"&'Solar prot device - data'!C50,\"\")","v":""},null,null,{"$f":"IF('Solar prot device - data'!D50<>\"\",'Solar prot device - data'!D50,\"\")","v":""},{"$f":"IF('Solar prot device - data'!E50<>\"\",'Solar prot device - data'!E50,\"\")","v":""},{"$f":"IF('Solar prot device - data'!F50<>\"\",'Solar prot device - data'!F50,\"\")","v":""},{"$f":"IF('Solar prot device - data'!G50<>\"\",'Solar prot device - data'!G50,\"\")","v":""},"","","","","","","","","","","","","","","",null,"","","","","","","","","","",null,"","","","","","","","","","",null,"","","","","","","","","","","","","","",""]
[null,{"$f":"'Solar prot device - data'!B51","v":37},{"$f":"IF('Solar prot device - data'!C51<>\"\",\"Glazing\"&\" + \"&'Solar prot device - data'!C51,\"\")","v":""},null,null,{"$f":"IF('Solar prot device - data'!D51<>\"\",'Solar prot device - data'!D51,\"\")","v":""},{"$f":"IF('Solar prot device - data'!E51<>\"\",'Solar prot device - data'!E51,\"\")","v":""},{"$f":"IF('Solar prot device - data'!F51<>\"\",'Solar prot device - data'!F51,\"\")","v":""},{"$f":"IF('Solar prot device - data'!G51<>\"\",'Solar prot device - data'!G51,\"\")","v":""},"","","","","","","","","","","","","","","",null,"","","","","","","","","","",null,"","","","","","","","","","",null,"","","","","","","","","","","","","","",""]
[null,{"$f":"'Solar prot device - data'!B52","v":38},{"$f":"IF('Solar prot device - data'!C52<>\"\",\"Glazing\"&\" + \"&'Solar prot device - data'!C52,\"\")","v":""},null,null,{"$f":"IF('Solar prot device - data'!D52<>\"\",'Solar prot device - data'!D52,\"\")","v":""},{"$f":"IF('Solar prot device - data'!E52<>\"\",'Solar prot device - data'!E52,\"\")","v":""},{"$f":"IF('Solar prot device - data'!F52<>\"\",'Solar prot device - data'!F52,\"\")","v":""},{"$f":"IF('Solar prot device - data'!G52<>\"\",'Solar prot device - data'!G52,\"\")","v":""},"","","","","","","","","","","","","","","",null,"","","","","","","","","","",null,"","","","","","","","","","",null,"","","","","","","","","","","","","","",""]
[null,{"$f":"'Solar prot device - data'!B53","v":39},{"$f":"IF('Solar prot device - data'!C53<>\"\",\"Glazing\"&\" + \"&'Solar prot device - data'!C53,\"\")","v":""},null,null,{"$f":"IF('Solar prot device - data'!D53<>\"\",'Solar prot device - data'!D53,\"\")","v":""},{"$f":"IF('Solar prot device - data'!E53<>\"\",'Solar prot device - data'!E53,\"\")","v":""},{"$f":"IF('Solar prot device - data'!F53<>\"\",'Solar prot device - data'!F53,\"\")","v":""},{"$f":"IF('Solar prot device - data'!G53<>\"\",'Solar prot device - data'!G53,\"\")","v":""},"","","","","","","","","","","","","","","",null,"","","","","","","","","","",null,"","","","","","","","","","",null,"","","","","","","","","","","","","","",""]
[null,{"$f":"'Solar prot device - data'!B54","v":40},{"$f":"IF('Solar prot device - data'!C54<>\"\",\"Glazing\"&\" + \"&'Solar prot device - data'!C54,\"\")","v":""},null,null,{"$f":"IF('Solar prot device - data'!D54<>\"\",'Solar prot device - data'!D54,\"\")","v":""},{"$f":"IF('Solar prot device - data'!E54<>\"\",'Solar prot device - data'!E54,\"\")","v":""},{"$f":"IF('Solar prot device - data'!F54<>\"\",'Solar prot device - data'!F54,\"\")","v":""},{"$f":"IF('Solar prot device - data'!G54<>\"\",'Solar prot device - data'!G54,\"\")","v":""},"","","","","","","","","","","","","","","",null,"","","","","","","","","","",null,"","","","","","","","","","",null,"","","","","","","","","","","","","","",""]
[null,{"$f":"'Solar prot device - data'!B55","v":41},{"$f":"IF('Solar prot device - data'!C55<>\"\",\"Glazing\"&\" + \"&'Solar prot device - data'!C55,\"\")","v":""},null,null,{"$f":"IF('Solar prot device - data'!D55<>\"\",'Solar prot device - data'!D55,\"\")","v":""},{"$f":"IF('Solar prot device - data'!E55<>\"\",'Solar prot device - data'!E55,\"\")","v":""},{"$f":"IF('Solar prot device - data'!F55<>\"\",'Solar prot device - data'!F55,\"\")","v":""},{"$f":"IF('Solar prot device - data'!G55<>\"\",'Solar prot device - data'!G55,\"\")","v":""},"","","","","","","","","","","","","","","",null,"","","","","","","","","","",null,"","","","","","","","","","",null,"","","","","","","","","","","","","","",""]
[null,{"$f":"'Solar prot device - data'!B56","v":42},{"$f":"IF('Solar prot device - data'!C56<>\"\",\"Glazing\"&\" + \"&'Solar prot device - data'!C56,\"\")","v":""},null,null,{"$f":"IF('Solar prot device - data'!D56<>\"\",'Solar prot device - data'!D56,\"\")","v":""},{"$f":"IF('Solar prot device - data'!E56<>\"\",'Solar prot device - data'!E56,\"\")","v":""},{"$f":"IF('Solar prot device - data'!F56<>\"\",'Solar prot device - data'!F56,\"\")","v":""},{"$f":"IF('Solar prot device - data'!G56<>\"\",'Solar prot device - data'!G56,\"\")","v":""},"","","","","","","","","","","","","","","",null,"","","","","","","","","","",null,"","","","","","","","","","",null,"","","","","","","","","","","","","","",""]
[null,{"$f":"'Solar prot device - data'!B57","v":43},{"$f":"IF('Solar prot device - data'!C57<>\"\",\"Glazing\"&\" + \"&'Solar prot device - data'!C57,\"\")","v":""},null,null,{"$f":"IF('Solar prot device - data'!D57<>\"\",'Solar prot device - data'!D57,\"\")","v":""},{"$f":"IF('Solar prot device - data'!E57<>\"\",'Solar prot device - data'!E57,\"\")","v":""},{"$f":"IF('Solar prot device - data'!F57<>\"\",'Solar prot device - data'!F57,\"\")","v":""},{"$f":"IF('Solar prot device - data'!G57<>\"\",'Solar prot device - data'!G57,\"\")","v":""},"","","","","","","","","","","","","","","",null,"","","","","","","","","","",null,"","","","","","","","","","",null,"","","","","","","","","","","","","","",""]
[null,{"$f":"'Solar prot device - data'!B58","v":44},{"$f":"IF('Solar prot device - data'!C58<>\"\",\"Glazing\"&\" + \"&'Solar prot device - data'!C58,\"\")","v":""},null,null,{"$f":"IF('Solar prot device - data'!D58<>\"\",'Solar prot device - data'!D58,\"\")","v":""},{"$f":"IF('Solar prot device - data'!E58<>\"\",'Solar prot device - data'!E58,\"\")","v":""},{"$f":"IF('Solar prot device - data'!F58<>\"\",'Solar prot device - data'!F58,\"\")","v":""},{"$f":"IF('Solar prot device - data'!G58<>\"\",'Solar prot device - data'!G58,\"\")","v":""},"","","","","","","","","","","","","","","",null,"","","","","","","","","","",null,"","","","","","","","","","",null,"","","","","","","","","","","","","","",""]
[null,{"$f":"'Solar prot device - data'!B59","v":45},{"$f":"IF('Solar prot device - data'!C59<>\"\",\"Glazing\"&\" + \"&'Solar prot device - data'!C59,\"\")","v":""},null,null,{"$f":"IF('Solar prot device - data'!D59<>\"\",'Solar prot device - data'!D59,\"\")","v":""},{"$f":"IF('Solar prot device - data'!E59<>\"\",'Solar prot device - data'!E59,\"\")","v":""},{"$f":"IF('Solar prot device - data'!F59<>\"\",'Solar prot device - data'!F59,\"\")","v":""},{"$f":"IF('Solar prot device - data'!G59<>\"\",'Solar prot device - data'!G59,\"\")","v":""},"","","","","","","","","","","","","","","",null,"","","","","","","","","","",null,"","","","","","","","","","",null,"","","","","","","","","","","","","","",""]
[null,{"$f":"'Solar prot device - data'!B60","v":46},{"$f":"IF('Solar prot device - data'!C60<>\"\",\"Glazing\"&\" + \"&'Solar prot device - data'!C60,\"\")","v":""},null,null,{"$f":"IF('Solar prot device - data'!D60<>\"\",'Solar prot device - data'!D60,\"\")","v":""},{"$f":"IF('Solar prot device - data'!E60<>\"\",'Solar prot device - data'!E60,\"\")","v":""},{"$f":"IF('Solar prot device - data'!F60<>\"\",'Solar prot device - data'!F60,\"\")","v":""},{"$f":"IF('Solar prot device - data'!G60<>\"\",'Solar prot device - data'!G60,\"\")","v":""},"","","","","","","","","","","","","","","",null,"","","","","","","","","","",null,"","","","","","","","","","",null,"","","","","","","","","","","","","","",""]
[null,{"$f":"'Solar prot device - data'!B61","v":47},{"$f":"IF('Solar prot device - data'!C61<>\"\",\"Glazing\"&\" + \"&'Solar prot device - data'!C61,\"\")","v":""},null,null,{"$f":"IF('Solar prot device - data'!D61<>\"\",'Solar prot device - data'!D61,\"\")","v":""},{"$f":"IF('Solar prot device - data'!E61<>\"\",'Solar prot device - data'!E61,\"\")","v":""},{"$f":"IF('Solar prot device - data'!F61<>\"\",'Solar prot device - data'!F61,\"\")","v":""},{"$f":"IF('Solar prot device - data'!G61<>\"\",'Solar prot device - data'!G61,\"\")","v":""},"","","","","","","","","","","","","","","",null,"","","","","","","","","","",null,"","","","","","","","","","",null,"","","","","","","","","","","","","","",""]
[null,{"$f":"'Solar prot device - data'!B62","v":48},{"$f":"IF('Solar prot device - data'!C62<>\"\",\"Glazing\"&\" + \"&'Solar prot device - data'!C62,\"\")","v":""},null,null,{"$f":"IF('Solar prot device - data'!D62<>\"\",'Solar prot device - data'!D62,\"\")","v":""},{"$f":"IF('Solar prot device - data'!E62<>\"\",'Solar prot device - data'!E62,\"\")","v":""},{"$f":"IF('Solar prot device - data'!F62<>\"\",'Solar prot device - data'!F62,\"\")","v":""},{"$f":"IF('Solar prot device - data'!G62<>\"\",'Solar prot device - data'!G62,\"\")","v":""},"","","","","","","","","","","","","","","",null,"","","","","","","","","","",null,"","","","","","","","","","",null,"","","","","","","","","","","","","","",""]
[null,{"$f":"'Solar prot device - data'!B63","v":49},{"$f":"IF('Solar prot device - data'!C63<>\"\",\"Glazing\"&\" + \"&'Solar prot device - data'!C63,\"\")","v":""},null,null,{"$f":"IF('Solar prot device - data'!D63<>\"\",'Solar prot device - data'!D63,\"\")","v":""},{"$f":"IF('Solar prot device - data'!E63<>\"\",'Solar prot device - data'!E63,\"\")","v":""},{"$f":"IF('Solar prot device - data'!F63<>\"\",'Solar prot device - data'!F63,\"\")","v":""},{"$f":"IF('Solar prot device - data'!G63<>\"\",'Solar prot device - data'!G63,\"\")","v":""},"","","","","","","","","","","","","","","",null,"","","","","","","","","","",null,"","","","","","","","","","",null,"","","","","","","","","","","","","","",""]
[null,{"$f":"'Solar prot device - data'!B64","v":50},{"$f":"IF('Solar prot device - data'!C64<>\"\",\"Glazing\"&\" + \"&'Solar prot device - data'!C64,\"\")","v":""},null,null,{"$f":"IF('Solar prot device - data'!D64<>\"\",'Solar prot device - data'!D64,\"\")","v":""},{"$f":"IF('Solar prot device - data'!E64<>\"\",'Solar prot device - data'!E64,\"\")","v":""},{"$f":"IF('Solar prot device - data'!F64<>\"\",'Solar prot device - data'!F64,\"\")","v":""},{"$f":"IF('Solar prot device - data'!G64<>\"\",'Solar prot device - data'!G64,\"\")","v":""},"","","","","","","","","","","","","","","",null,"","","","","","","","","","",null,"","","","","","","","","","",null,"","","","","","","","","","","","","","",""]
[null,{"$f":"'Solar prot device - data'!B65","v":51},{"$f":"IF('Solar prot device - data'!C65<>\"\",\"Glazing\"&\" + \"&'Solar prot device - data'!C65,\"\")","v":""},null,null,{"$f":"IF('Solar prot device - data'!D65<>\"\",'Solar prot device - data'!D65,\"\")","v":""},{"$f":"IF('Solar prot device - data'!E65<>\"\",'Solar prot device - data'!E65,\"\")","v":""},{"$f":"IF('Solar prot device - data'!F65<>\"\",'Solar prot device - data'!F65,\"\")","v":""},{"$f":"IF('Solar prot device - data'!G65<>\"\",'Solar prot device - data'!G65,\"\")","v":""},"","","","","","","","","","","","","","","",null,"","","","","","","","","","",null,"","","","","","","","","","",null,"","","","","","","","","","","","","","",""]
[null,{"$f":"'Solar prot device - data'!B66","v":52},{"$f":"IF('Solar prot device - data'!C66<>\"\",\"Glazing\"&\" + \"&'Solar prot device - data'!C66,\"\")","v":""},null,null,{"$f":"IF('Solar prot device - data'!D66<>\"\",'Solar prot device - data'!D66,\"\")","v":""},{"$f":"IF('Solar prot device - data'!E66<>\"\",'Solar prot device - data'!E66,\"\")","v":""},{"$f":"IF('Solar prot device - data'!F66<>\"\",'Solar prot device - data'!F66,\"\")","v":""},{"$f":"IF('Solar prot device - data'!G66<>\"\",'Solar prot device - data'!G66,\"\")","v":""},"","","","","","","","","","","","","","","",null,"","","","","","","","","","",null,"","","","","","","","","","",null,"","","","","","","","","","","","","","",""]
[null,{"$f":"'Solar prot device - data'!B67","v":53},{"$f":"IF('Solar prot device - data'!C67<>\"\",\"Glazing\"&\" + \"&'Solar prot device - data'!C67,\"\")","v":""},null,null,{"$f":"IF('Solar prot device - data'!D67<>\"\",'Solar prot device - data'!D67,\"\")","v":""},{"$f":"IF('Solar prot device - data'!E67<>\"\",'Solar prot device - data'!E67,\"\")","v":""},{"$f":"IF('Solar prot device - data'!F67<>\"\",'Solar prot device - data'!F67,\"\")","v":""},{"$f":"IF('Solar prot device - data'!G67<>\"\",'Solar prot device - data'!G67,\"\")","v":""},"","","","","","","","","","","","","","","",null,"","","","","","","","","","",null,"","","","","","","","","","",null,"","","","","","","","","","","","","","",""]
[null,{"$f":"'Solar prot device - data'!B68","v":54},{"$f":"IF('Solar prot device - data'!C68<>\"\",\"Glazing\"&\" + \"&'Solar prot device - data'!C68,\"\")","v":""},null,null,{"$f":"IF('Solar prot device - data'!D68<>\"\",'Solar prot device - data'!D68,\"\")","v":""},{"$f":"IF('Solar prot device - data'!E68<>\"\",'Solar prot device - data'!E68,\"\")","v":""},{"$f":"IF('Solar prot device - data'!F68<>\"\",'Solar prot device - data'!F68,\"\")","v":""},{"$f":"IF('Solar prot device - data'!G68<>\"\",'Solar prot device - data'!G68,\"\")","v":""},"","","","","","","","","","","","","","","",null,"","","","","","","","","","",null,"","","","","","","","","","",null,"","","","","","","","","","","","","","",""]
[null,{"$f":"'Solar prot device - data'!B69","v":55},{"$f":"IF('Solar prot device - data'!C69<>\"\",\"Glazing\"&\" + \"&'Solar prot device - data'!C69,\"\")","v":""},null,null,{"$f":"IF('Solar prot device - data'!D69<>\"\",'Solar prot device - data'!D69,\"\")","v":""},{"$f":"IF('Solar prot device - data'!E69<>\"\",'Solar prot device - data'!E69,\"\")","v":""},{"$f":"IF('Solar prot device - data'!F69<>\"\",'Solar prot device - data'!F69,\"\")","v":""},{"$f":"IF('Solar prot device - data'!G69<>\"\",'Solar prot device - data'!G69,\"\")","v":""},"","","","","","","","","","","","","","","",null,"","","","","","","","","","",null,"","","","","","","","","","",null,"","","","","","","","","","","","","","",""]
[null,{"$f":"'Solar prot device - data'!B70","v":56},{"$f":"IF('Solar prot device - data'!C70<>\"\",\"Glazing\"&\" + \"&'Solar prot device - data'!C70,\"\")","v":""},null,null,{"$f":"IF('Solar prot device - data'!D70<>\"\",'Solar prot device - data'!D70,\"\")","v":""},{"$f":"IF('Solar prot device - data'!E70<>\"\",'Solar prot device - data'!E70,\"\")","v":""},{"$f":"IF('Solar prot device - data'!F70<>\"\",'Solar prot device - data'!F70,\"\")","v":""},{"$f":"IF('Solar prot device - data'!G70<>\"\",'Solar prot device - data'!G70,\"\")","v":""},"","","","","","","","","","","","","","","",null,"","","","","","","","","","",null,"","","","","","","","","","",null,"","","","","","","","","","","","","","",""]
[null,{"$f":"'Solar prot device - data'!B71","v":57},{"$f":"IF('Solar prot device - data'!C71<>\"\",\"Glazing\"&\" + \"&'Solar prot device - data'!C71,\"\")","v":""},null,null,{"$f":"IF('Solar prot device - data'!D71<>\"\",'Solar prot device - data'!D71,\"\")","v":""},{"$f":"IF('Solar prot device - data'!E71<>\"\",'Solar prot device - data'!E71,\"\")","v":""},{"$f":"IF('Solar prot device - data'!F71<>\"\",'Solar prot device - data'!F71,\"\")","v":""},{"$f":"IF('Solar prot device - data'!G71<>\"\",'Solar prot device - data'!G71,\"\")","v":""},"","","","","","","","","","","","","","","",null,"","","","","","","","","","",null,"","","","","","","","","","",null,"","","","","","","","","","","","","","",""]
[null,{"$f":"'Solar prot device - data'!B72","v":58},{"$f":"IF('Solar prot device - data'!C72<>\"\",\"Glazing\"&\" + \"&'Solar prot device - data'!C72,\"\")","v":""},null,null,{"$f":"IF('Solar prot device - data'!D72<>\"\",'Solar prot device - data'!D72,\"\")","v":""},{"$f":"IF('Solar prot device - data'!E72<>\"\",'Solar prot device - data'!E72,\"\")","v":""},{"$f":"IF('Solar prot device - data'!F72<>\"\",'Solar prot device - data'!F72,\"\")","v":""},{"$f":"IF('Solar prot device - data'!G72<>\"\",'Solar prot device - data'!G72,\"\")","v":""},"","","","","","","","","","","","","","","",null,"","","","","","","","","","",null,"","","","","","","","","","",null,"","","","","","","","","","","","","","",""]
[null,{"$f":"'Solar prot device - data'!B73","v":59},{"$f":"IF('Solar prot device - data'!C73<>\"\",\"Glazing\"&\" + \"&'Solar prot device - data'!C73,\"\")","v":""},null,null,{"$f":"IF('Solar prot device - data'!D73<>\"\",'Solar prot device - data'!D73,\"\")","v":""},{"$f":"IF('Solar prot device - data'!E73<>\"\",'Solar prot device - data'!E73,\"\")","v":""},{"$f":"IF('Solar prot device - data'!F73<>\"\",'Solar prot device - data'!F73,\"\")","v":""},{"$f":"IF('Solar prot device - data'!G73<>\"\",'Solar prot device - data'!G73,\"\")","v":""},"","","","","","","","","","","","","","","",null,"","","","","","","","","","",null,"","","","","","","","","","",null,"","","","","","","","","","","","","","",""]
[null,{"$f":"'Solar prot device - data'!B74","v":60},{"$f":"IF('Solar prot device - data'!C74<>\"\",\"Glazing\"&\" + \"&'Solar prot device - data'!C74,\"\")","v":""},null,null,{"$f":"IF('Solar prot device - data'!D74<>\"\",'Solar prot device - data'!D74,\"\")","v":""},{"$f":"IF('Solar prot device - data'!E74<>\"\",'Solar prot device - data'!E74,\"\")","v":""},{"$f":"IF('Solar prot device - data'!F74<>\"\",'Solar prot device - data'!F74,\"\")","v":""},{"$f":"IF('Solar prot device - data'!G74<>\"\",'Solar prot device - data'!G74,\"\")","v":""},"","","","","","","","","","","","","","","",null,"","","","","","","","","","",null,"","","","","","","","","","",null,"","","","","","","","","","","","","","",""]
[null,{"$f":"'Solar prot device - data'!B75","v":61},{"$f":"IF('Solar prot device - data'!C75<>\"\",\"Glazing\"&\" + \"&'Solar prot device - data'!C75,\"\")","v":""},null,null,{"$f":"IF('Solar prot device - data'!D75<>\"\",'Solar prot device - data'!D75,\"\")","v":""},{"$f":"IF('Solar prot device - data'!E75<>\"\",'Solar prot device - data'!E75,\"\")","v":""},{"$f":"IF('Solar prot device - data'!F75<>\"\",'Solar prot device - data'!F75,\"\")","v":""},{"$f":"IF('Solar prot device - data'!G75<>\"\",'Solar prot device - data'!G75,\"\")","v":""},"","","","","","","","","","","","","","","",null,"","","","","","","","","","",null,"","","","","","","","","","",null,"","","","","","","","","","","","","","",""]
[null,{"$f":"'Solar prot device - data'!B76","v":62},{"$f":"IF('Solar prot device - data'!C76<>\"\",\"Glazing\"&\" + \"&'Solar prot device - data'!C76,\"\")","v":""},null,null,{"$f":"IF('Solar prot device - data'!D76<>\"\",'Solar prot device - data'!D76,\"\")","v":""},{"$f":"IF('Solar prot device - data'!E76<>\"\",'Solar prot device - data'!E76,\"\")","v":""},{"$f":"IF('Solar prot device - data'!F76<>\"\",'Solar prot device - data'!F76,\"\")","v":""},{"$f":"IF('Solar prot device - data'!G76<>\"\",'Solar prot device - data'!G76,\"\")","v":""},"","","","","","","","","","","","","","","",null,"","","","","","","","","","",null,"","","","","","","","","","",null,"","","","","","","","","","","","","","",""]
[null,{"$f":"'Solar prot device - data'!B77","v":63},{"$f":"IF('Solar prot device - data'!C77<>\"\",\"Glazing\"&\" + \"&'Solar prot device - data'!C77,\"\")","v":""},null,null,{"$f":"IF('Solar prot device - data'!D77<>\"\",'Solar prot device - data'!D77,\"\")","v":""},{"$f":"IF('Solar prot device - data'!E77<>\"\",'Solar prot device - data'!E77,\"\")","v":""},{"$f":"IF('Solar prot device - data'!F77<>\"\",'Solar prot device - data'!F77,\"\")","v":""},{"$f":"IF('Solar prot device - data'!G77<>\"\",'Solar prot device - data'!G77,\"\")","v":""},"","","","","","","","","","","","","","","",null,"","","","","","","","","","",null,"","","","","","","","","","",null,"","","","","","","","","","","","","","",""]
[null,{"$f":"'Solar prot device - data'!B78","v":64},{"$f":"IF('Solar prot device - data'!C78<>\"\",\"Glazing\"&\" + \"&'Solar prot device - data'!C78,\"\")","v":""},null,null,{"$f":"IF('Solar prot device - data'!D78<>\"\",'Solar prot device - data'!D78,\"\")","v":""},{"$f":"IF('Solar prot device - data'!E78<>\"\",'Solar prot device - data'!E78,\"\")","v":""},{"$f":"IF('Solar prot device - data'!F78<>\"\",'Solar prot device - data'!F78,\"\")","v":""},{"$f":"IF('Solar prot device - data'!G78<>\"\",'Solar prot device - data'!G78,\"\")","v":""},"","","","","","","","","","","","","","","",null,"","","","","","","","","","",null,"","","","","","","","","","",null,"","","","","","","","","","","","","","",""]
[null,{"$f":"'Solar prot device - data'!B79","v":65},{"$f":"IF('Solar prot device - data'!C79<>\"\",\"Glazing\"&\" + \"&'Solar prot device - data'!C79,\"\")","v":""},null,null,{"$f":"IF('Solar prot device - data'!D79<>\"\",'Solar prot device - data'!D79,\"\")","v":""},{"$f":"IF('Solar prot device - data'!E79<>\"\",'Solar prot device - data'!E79,\"\")","v":""},{"$f":"IF('Solar prot device - data'!F79<>\"\",'Solar prot device - data'!F79,\"\")","v":""},{"$f":"IF('Solar prot device - data'!G79<>\"\",'Solar prot device - data'!G79,\"\")","v":""},"","","","","","","","","","","","","","","",null,"","","","","","","","","","",null,"","","","","","","","","","",null,"","","","","","","","","","","","","","",""]
[null,{"$f":"'Solar prot device - data'!B80","v":66},{"$f":"IF('Solar prot device - data'!C80<>\"\",\"Glazing\"&\" + \"&'Solar prot device - data'!C80,\"\")","v":""},null,null,{"$f":"IF('Solar prot device - data'!D80<>\"\",'Solar prot device - data'!D80,\"\")","v":""},{"$f":"IF('Solar prot device - data'!E80<>\"\",'Solar prot device - data'!E80,\"\")","v":""},{"$f":"IF('Solar prot device - data'!F80<>\"\",'Solar prot device - data'!F80,\"\")","v":""},{"$f":"IF('Solar prot device - data'!G80<>\"\",'Solar prot device - data'!G80,\"\")","v":""},{"$f":"IF(AND($F80<>\"\",$G80<>\"\"),$F80*BM$4+$I80*BM$9/BM$6+$F80*(1-BM$4)*BM$9/BM$5,\"\")","v":""},{"$f":"IF(AND($F80<>\"\",$G80<>\"\"),$F80*BN$4+$I80*BN$9/BN$6+$F80*(1-BN$4)*BN$9/BN$5,\"\")","v":""},{"$f":"IF(AND($F80<>\"\",$G80<>\"\"),$F80*BO$4+$I80*BO$9/BO$6+$F80*(1-BO$4)*BO$9/BO$5,\"\")","v":""},{"$f":"IF(AND($F80<>\"\",$G80<>\"\"),$F80*BP$4+$I80*BP$9/BP$6+$F80*(1-BP$4)*BP$9/BP$5,\"\")","v":""},{"$f":"IF(AND($F80<>\"\",$G80<>\"\"),$F80*BQ$4+$I80*BQ$9/BQ$6+$F80*(1-BQ$4)*BQ$9/BQ$5,\"\")","v":""},{"$f":"IF(AND($F80<>\"\",$G80<>\"\"),BM$4*(1-BM$4*$G80-$I80*BM$10/BM$7),\"\")","v":""},{"$f":"IF(AND($F80<>\"\",$G80<>\"\"),BN$4*(1-BN$4*$G80-$I80*BN$10/BN$7),\"\")","v":""},{"$f":"IF(AND($F80<>\"\",$G80<>\"\"),BO$4*(1-BO$4*$G80-$I80*BO$10/BO$7),\"\")","v":""},{"$f":"IF(AND($F80<>\"\",$G80<>\"\"),BP$4*(1-BP$4*$G80-$I80*BP$10/BP$7),\"\")","v":""},{"$f":"IF(AND($F80<>\"\",$G80<>\"\"),BQ$4*(1-BQ$4*$G80-$I80*BQ$10/BQ$7),\"\")","v":""},{"$f":"IF(AND($F80<>\"\",$G80<>\"\"),BM$4*$F80+BM$4*($I80+(1-BM$4)*$G80)*BM$11/BM$8,\"\")","v":""},{"$f":"IF(AND($F80<>\"\",$G80<>\"\"),BN$4*$F80+BN$4*($I80+(1-BN$4)*$G80)*BN$11/BN$8,\"\")","v":""},{"$f":"IF(AND($F80<>\"\",$G80<>\"\"),BO$4*$F80+BO$4*($I80+(1-BO$4)*$G80)*BO$11/BO$8,\"\")","v":""},{"$f":"IF(AND($F80<>\"\",$G80<>\"\"),BP$4*$F80+BP$4*($I80+(1-BP$4)*$G80)*BP$11/BP$8,\"\")","v":""},{"$f":"IF(AND($F80<>\"\",$G80<>\"\"),BQ$4*$F80+BQ$4*($I80+(1-BQ$4)*$G80)*BQ$11/BQ$8,\"\")","v":""},null,{"$f":"IF(AND($F80<>\"\",$H80<>\"\"),$F$5*$F80/(1-$G$5*$H80),\"\")","v":""},{"$f":"IF(AND($F80<>\"\",$H80<>\"\"),$F$6*$F80/(1-$G$6*$H80),\"\")","v":""},{"$f":"IF(AND($F80<>\"\",$H80<>\"\"),$F$7*$F80/(1-$G$7*$H80),\"\")","v":""},{"$f":"IF(AND($F80<>\"\",$H80<>\"\"),$F$8*$F80/(1-$G$8*$H80),\"\")","v":""},{"$f":"IF(AND($F80<>\"\",$H80<>\"\"),$F$9*$F80/(1-$G$9*$H80),\"\")","v":""},{"$f":"IF(AND($F80<>\"\",$G80<>\"\"),$F$5*$F80/(1-$H$5*$G80),\"\")","v":""},{"$f":"IF(AND($F80<>\"\",$G80<>\"\"),$F$6*$F80/(1-$H$6*$G80),\"\")","v":""},{"$f":"IF(AND($F80<>\"\",$G80<>\"\"),$F$7*$F80/(1-$H$7*$G80),\"\")","v":""},{"$f":"IF(AND($F80<>\"\",$G80<>\"\"),$F$8*$F80/(1-$H$8*$G80),\"\")","v":""},{"$f":"IF(AND($F80<>\"\",$G80<>\"\"),$F$9*$F80/(1-$H$9*$G80),\"\")","v":""},null,{"$f":"IF(AND(J80<>\"\",Z80<>\"\"),J80-Z80,\"\")","v":""},{"$f":"IF(AND(K80<>\"\",AA80<>\"\"),K80-AA80,\"\")","v":""},{"$f":"IF(AND(L80<>\"\",AB80<>\"\"),L80-AB80,\"\")","v":""},{"$f":"IF(AND(M80<>\"\",AC80<>\"\"),M80-AC80,\"\")","v":""},{"$f":"IF(AND(N80<>\"\",AD80<>\"\"),N80-AD80,\"\")","v":""},{"$f":"IF(AND(O80<>\"\",AE80<>\"\"),O80-AE80,\"\")","v":""},{"$f":"IF(AND(P80<>\"\",AF80<>\"\"),P80-AF80,\"\")","v":""},{"$f":"IF(AND(Q80<>\"\",AG80<>\"\"),Q80-AG80,\"\")","v":""},{"$f":"IF(AND(R80<>\"\",AH80<>\"\"),R80-AH80,\"\")","v":""},{"$f":"IF(AND(S80<>\"\",AI80<>\"\"),S80-AI80,\"\")","v":""},null,{"$f":"IF(J80<>\"\", J80/$E$5,\"\")","v":""},{"$f":"IF(K80<>\"\", K80/$E$6,\"\")","v":""},{"$f":"IF(L80<>\"\", L80/$E$7,\"\")","v":""},{"$f":"IF(M80<>\"\", M80/$E$8,\"\")","v":""},{"$f":"IF(N80<>\"\", N80/$E$9,\"\")","v":""},{"$f":"IF(O80<>\"\", O80/$E$5,\"\")","v":""},{"$f":"IF(P80<>\"\", P80/$E$6,\"\")","v":""},{"$f":"IF(Q80<>\"\", Q80/$E$7,\"\")","v":""},{"$f":"IF(R80<>\"\", R80/$E$8,\"\")","v":""},{"$f":"IF(S80<>\"\", S80/$E$9,\"\")","v":""},{"$f":"IF(T80<>\"\", T80/$E$5,\"\")","v":""},{"$f":"IF(U80<>\"\", U80/$E$6,\"\")","v":""},{"$f":"IF(V80<>\"\", V80/$E$7,\"\")","v":""},{"$f":"IF(W80<>\"\", W80/$E$8,\"\")","v":""},{"$f":"IF(X80<>\"\", X80/$E$9,\"\")","v":""}]
[null,{"$f":"'Solar prot device - data'!B81","v":67},{"$f":"IF('Solar prot device - data'!C81<>\"\",\"Glazing\"&\" + \"&'Solar prot device - data'!C81,\"\")","v":""},null,null,{"$f":"IF('Solar prot device - data'!D81<>\"\",'Solar prot device - data'!D81,\"\")","v":""},{"$f":"IF('Solar prot device - data'!E81<>\"\",'Solar prot device - data'!E81,\"\")","v":""},{"$f":"IF('Solar prot device - data'!F81<>\"\",'Solar prot device - data'!F81,\"\")","v":""},{"$f":"IF('Solar prot device - data'!G81<>\"\",'Solar prot device - data'!G81,\"\")","v":""},"","","","","","","","","","","","","","","",null,"","","","","","","","","","",null,"","","","","","","","","","",null,"","","","","","","","","","","","","","",""]
[null,{"$f":"'Solar prot device - data'!B82","v":68},{"$f":"IF('Solar prot device - data'!C82<>\"\",\"Glazing\"&\" + \"&'Solar prot device - data'!C82,\"\")","v":""},null,null,{"$f":"IF('Solar prot device - data'!D82<>\"\",'Solar prot device - data'!D82,\"\")","v":""},{"$f":"IF('Solar prot device - data'!E82<>\"\",'Solar prot device - data'!E82,\"\")","v":""},{"$f":"IF('Solar prot device - data'!F82<>\"\",'Solar prot device - data'!F82,\"\")","v":""},{"$f":"IF('Solar prot device - data'!G82<>\"\",'Solar prot device - data'!G82,\"\")","v":""},"","","","","","","","","","","","","","","",null,"","","","","","","","","","",null,"","","","","","","","","","",null,"","","","","","","","","","","","","","",""]
[null,{"$f":"'Solar prot device - data'!B83","v":69},{"$f":"IF('Solar prot device - data'!C83<>\"\",\"Glazing\"&\" + \"&'Solar prot device - data'!C83,\"\")","v":""},null,null,{"$f":"IF('Solar prot device - data'!D83<>\"\",'Solar prot device - data'!D83,\"\")","v":""},{"$f":"IF('Solar prot device - data'!E83<>\"\",'Solar prot device - data'!E83,\"\")","v":""},{"$f":"IF('Solar prot device - data'!F83<>\"\",'Solar prot device - data'!F83,\"\")","v":""},{"$f":"IF('Solar prot device - data'!G83<>\"\",'Solar prot device - data'!G83,\"\")","v":""},"","","","","","","","","","","","","","","",null,"","","","","","","","","","",null,"","","","","","","","","","",null,"","","","","","","","","","","","","","",""]
[null,{"$f":"'Solar prot device - data'!B84","v":70},{"$f":"IF('Solar prot device - data'!C84<>\"\",\"Glazing\"&\" + \"&'Solar prot device - data'!C84,\"\")","v":""},null,null,{"$f":"IF('Solar prot device - data'!D84<>\"\",'Solar prot device - data'!D84,\"\")","v":""},{"$f":"IF('Solar prot device - data'!E84<>\"\",'Solar prot device - data'!E84,\"\")","v":""},{"$f":"IF('Solar prot device - data'!F84<>\"\",'Solar prot device - data'!F84,\"\")","v":""},{"$f":"IF('Solar prot device - data'!G84<>\"\",'Solar prot device - data'!G84,\"\")","v":""},"","","","","","","","","","","","","","","",null,"","","","","","","","","","",null,"","","","","","","","","","",null,"","","","","","","","","","","","","","",""]
[null,{"$f":"'Solar prot device - data'!B85","v":71},{"$f":"IF('Solar prot device - data'!C85<>\"\",\"Glazing\"&\" + \"&'Solar prot device - data'!C85,\"\")","v":""},null,null,{"$f":"IF('Solar prot device - data'!D85<>\"\",'Solar prot device - data'!D85,\"\")","v":""},{"$f":"IF('Solar prot device - data'!E85<>\"\",'Solar prot device - data'!E85,\"\")","v":""},{"$f":"IF('Solar prot device - data'!F85<>\"\",'Solar prot device - data'!F85,\"\")","v":""},{"$f":"IF('Solar prot device - data'!G85<>\"\",'Solar prot device - data'!G85,\"\")","v":""},"","","","","","","","","","","","","","","",null,"","","","","","","","","","",null,"","","","","","","","","","",null,"","","","","","","","","","","","","","",""]
[null,{"$f":"'Solar prot device - data'!B86","v":72},{"$f":"IF('Solar prot device - data'!C86<>\"\",\"Glazing\"&\" + \"&'Solar prot device - data'!C86,\"\")","v":""},null,null,{"$f":"IF('Solar prot device - data'!D86<>\"\",'Solar prot device - data'!D86,\"\")","v":""},{"$f":"IF('Solar prot device - data'!E86<>\"\",'Solar prot device - data'!E86,\"\")","v":""},{"$f":"IF('Solar prot device - data'!F86<>\"\",'Solar prot device - data'!F86,\"\")","v":""},{"$f":"IF('Solar prot device - data'!G86<>\"\",'Solar prot device - data'!G86,\"\")","v":""},"","","","","","","","","","","","","","","",null,"","","","","","","","","","",null,"","","","","","","","","","",null,"","","","","","","","","","","","","","",""]
[null,{"$f":"'Solar prot device - data'!B87","v":73},{"$f":"IF('Solar prot device - data'!C87<>\"\",\"Glazing\"&\" + \"&'Solar prot device - data'!C87,\"\")","v":""},null,null,{"$f":"IF('Solar prot device - data'!D87<>\"\",'Solar prot device - data'!D87,\"\")","v":""},{"$f":"IF('Solar prot device - data'!E87<>\"\",'Solar prot device - data'!E87,\"\")","v":""},{"$f":"IF('Solar prot device - data'!F87<>\"\",'Solar prot device - data'!F87,\"\")","v":""},{"$f":"IF('Solar prot device - data'!G87<>\"\",'Solar prot device - data'!G87,\"\")","v":""},"","","","","","","","","","","","","","","",null,"","","","","","","","","","",null,"","","","","","","","","","",null,"","","","","","","","","","","","","","",""]
[null,{"$f":"'Solar prot device - data'!B88","v":74},{"$f":"IF('Solar prot device - data'!C88<>\"\",\"Glazing\"&\" + \"&'Solar prot device - data'!C88,\"\")","v":""},null,null,{"$f":"IF('Solar prot device - data'!D88<>\"\",'Solar prot device - data'!D88,\"\")","v":""},{"$f":"IF('Solar prot device - data'!E88<>\"\",'Solar prot device - data'!E88,\"\")","v":""},{"$f":"IF('Solar prot device - data'!F88<>\"\",'Solar prot device - data'!F88,\"\")","v":""},{"$f":"IF('Solar prot device - data'!G88<>\"\",'Solar prot device - data'!G88,\"\")","v":""},"","","","","","","","","","","","","","","",null,"","","","","","","","","","",null,"","","","","","","","","","",null,"","","","","","","","","","","","","","",""]
[null,{"$f":"'Solar prot device - data'!B89","v":75},{"$f":"IF('Solar prot device - data'!C89<>\"\",\"Glazing\"&\" + \"&'Solar prot device - data'!C89,\"\")","v":""},null,null,{"$f":"IF('Solar prot device - data'!D89<>\"\",'Solar prot device - data'!D89,\"\")","v":""},{"$f":"IF('Solar prot device - data'!E89<>\"\",'Solar prot device - data'!E89,\"\")","v":""},{"$f":"IF('Solar prot device - data'!F89<>\"\",'Solar prot device - data'!F89,\"\")","v":""},{"$f":"IF('Solar prot device - data'!G89<>\"\",'Solar prot device - data'!G89,\"\")","v":""},"","","","","","","","","","","","","","","",null,"","","","","","","","","","",null,"","","","","","","","","","",null,"","","","","","","","","","","","","","",""]
[null,{"$f":"'Solar prot device - data'!B90","v":76},{"$f":"IF('Solar prot device - data'!C90<>\"\",\"Glazing\"&\" + \"&'Solar prot device - data'!C90,\"\")","v":""},null,null,{"$f":"IF('Solar prot device - data'!D90<>\"\",'Solar prot device - data'!D90,\"\")","v":""},{"$f":"IF('Solar prot device - data'!E90<>\"\",'Solar prot device - data'!E90,\"\")","v":""},{"$f":"IF('Solar prot device - data'!F90<>\"\",'Solar prot device - data'!F90,\"\")","v":""},{"$f":"IF('Solar prot device - data'!G90<>\"\",'Solar prot device - data'!G90,\"\")","v":""},"","","","","","","","","","","","","","","",null,"","","","","","","","","","",null,"","","","","","","","","","",null,"","","","","","","","","","","","","","",""]
[null,{"$f":"'Solar prot device - data'!B91","v":77},{"$f":"IF('Solar prot device - data'!C91<>\"\",\"Glazing\"&\" + \"&'Solar prot device - data'!C91,\"\")","v":""},null,null,{"$f":"IF('Solar prot device - data'!D91<>\"\",'Solar prot device - data'!D91,\"\")","v":""},{"$f":"IF('Solar prot device - data'!E91<>\"\",'Solar prot device - data'!E91,\"\")","v":""},{"$f":"IF('Solar prot device - data'!F91<>\"\",'Solar prot device - data'!F91,\"\")","v":""},{"$f":"IF('Solar prot device - data'!G91<>\"\",'Solar prot device - data'!G91,\"\")","v":""},"","","","","","","","","","","","","","","",null,"","","","","","","","","","",null,"","","","","","","","","","",null,"","","","","","","","","","","","","","",""]
[null,{"$f":"'Solar prot device - data'!B92","v":78},{"$f":"IF('Solar prot device - data'!C92<>\"\",\"Glazing\"&\" + \"&'Solar prot device - data'!C92,\"\")","v":""},null,null,{"$f":"IF('Solar prot device - data'!D92<>\"\",'Solar prot device - data'!D92,\"\")","v":""},{"$f":"IF('Solar prot device - data'!E92<>\"\",'Solar prot device - data'!E92,\"\")","v":""},{"$f":"IF('Solar prot device - data'!F92<>\"\",'Solar prot device - data'!F92,\"\")","v":""},{"$f":"IF('Solar prot device - data'!G92<>\"\",'Solar prot device - data'!G92,\"\")","v":""},"","","","","","","","","","","","","","","",null,"","","","","","","","","","",null,"","","","","","","","","","",null,"","","","","","","","","","","","","","",""]
[null,{"$f":"'Solar prot device - data'!B93","v":79},{"$f":"IF('Solar prot device - data'!C93<>\"\",\"Glazing\"&\" + \"&'Solar prot device - data'!C93,\"\")","v":""},null,null,{"$f":"IF('Solar prot device - data'!D93<>\"\",'Solar prot device - data'!D93,\"\")","v":""},{"$f":"IF('Solar prot device - data'!E93<>\"\",'Solar prot device - data'!E93,\"\")","v":""},{"$f":"IF('Solar prot device - data'!F93<>\"\",'Solar prot device - data'!F93,\"\")","v":""},{"$f":"IF('Solar prot device - data'!G93<>\"\",'Solar prot device - data'!G93,\"\")","v":""},"","","","","","","","","","","","","","","",null,"","","","","","","","","","",null,"","","","","","","","","","",null,"","","","","","","","","","","","","","",""]
[null,{"$f":"'Solar prot device - data'!B94","v":80},{"$f":"IF('Solar prot device - data'!C94<>\"\",\"Glazing\"&\" + \"&'Solar prot device - data'!C94,\"\")","v":""},null,null,{"$f":"IF('Solar prot device - data'!D94<>\"\",'Solar prot device - data'!D94,\"\")","v":""},{"$f":"IF('Solar prot device - data'!E94<>\"\",'Solar prot device - data'!E94,\"\")","v":""},{"$f":"IF('Solar prot device - data'!F94<>\"\",'Solar prot device - data'!F94,\"\")","v":""},{"$f":"IF('Solar prot device - data'!G94<>\"\",'Solar prot device - data'!G94,\"\")","v":""},"","","","","","","","","","","","","","","",null,"","","","","","","","","","",null,"","","","","","","","","","",null,"","","","","","","","","","","","","","",""]
[null,{"$f":"'Solar prot device - data'!B95","v":81},{"$f":"IF('Solar prot device - data'!C95<>\"\",\"Glazing\"&\" + \"&'Solar prot device - data'!C95,\"\")","v":""},null,null,{"$f":"IF('Solar prot device - data'!D95<>\"\",'Solar prot device - data'!D95,\"\")","v":""},{"$f":"IF('Solar prot device - data'!E95<>\"\",'Solar prot device - data'!E95,\"\")","v":""},{"$f":"IF('Solar prot device - data'!F95<>\"\",'Solar prot device - data'!F95,\"\")","v":""},{"$f":"IF('Solar prot device - data'!G95<>\"\",'Solar prot device - data'!G95,\"\")","v":""},"","","","","","","","","","","","","","","",null,"","","","","","","","","","",null,"","","","","","","","","","",null,"","","","","","","","","","","","","","",""]
[null,{"$f":"'Solar prot device - data'!B96","v":82},{"$f":"IF('Solar prot device - data'!C96<>\"\",\"Glazing\"&\" + \"&'Solar prot device - data'!C96,\"\")","v":""},null,null,{"$f":"IF('Solar prot device - data'!D96<>\"\",'Solar prot device - data'!D96,\"\")","v":""},{"$f":"IF('Solar prot device - data'!E96<>\"\",'Solar prot device - data'!E96,\"\")","v":""},{"$f":"IF('Solar prot device - data'!F96<>\"\",'Solar prot device - data'!F96,\"\")","v":""},{"$f":"IF('Solar prot device - data'!G96<>\"\",'Solar prot device - data'!G96,\"\")","v":""},"","","","","","","","","","","","","","","",null,"","","","","","","","","","",null,"","","","","","","","","","",null,"","","","","","","","","","","","","","",""]
[null,{"$f":"'Solar prot device - data'!B97","v":83},{"$f":"IF('Solar prot device - data'!C97<>\"\",\"Glazing\"&\" + \"&'Solar prot device - data'!C97,\"\")","v":""},null,null,{"$f":"IF('Solar prot device - data'!D97<>\"\",'Solar prot device - data'!D97,\"\")","v":""},{"$f":"IF('Solar prot device - data'!E97<>\"\",'Solar prot device - data'!E97,\"\")","v":""},{"$f":"IF('Solar prot device - data'!F97<>\"\",'Solar prot device - data'!F97,\"\")","v":""},{"$f":"IF('Solar prot device - data'!G97<>\"\",'Solar prot device - data'!G97,\"\")","v":""},"","","","","","","","","","","","","","","",null,"","","","","","","","","","",null,"","","","","","","","","","",null,"","","","","","","","","","","","","","",""]
[null,{"$f":"'Solar prot device - data'!B98","v":84},{"$f":"IF('Solar prot device - data'!C98<>\"\",\"Glazing\"&\" + \"&'Solar prot device - data'!C98,\"\")","v":""},null,null,{"$f":"IF('Solar prot device - data'!D98<>\"\",'Solar prot device - data'!D98,\"\")","v":""},{"$f":"IF('Solar prot device - data'!E98<>\"\",'Solar prot device - data'!E98,\"\")","v":""},{"$f":"IF('Solar prot device - data'!F98<>\"\",'Solar prot device - data'!F98,\"\")","v":""},{"$f":"IF('Solar prot device - data'!G98<>\"\",'Solar prot device - data'!G98,\"\")","v":""},"","","","","","","","","","","","","","","",null,"","","","","","","","","","",null,"","","","","","","","","","",null,"","","","","","","","","","","","","","",""]
[null,{"$f":"'Solar prot device - data'!B99","v":85},{"$f":"IF('Solar prot device - data'!C99<>\"\",\"Glazing\"&\" + \"&'Solar prot device - data'!C99,\"\")","v":""},null,null,{"$f":"IF('Solar prot device - data'!D99<>\"\",'Solar prot device - data'!D99,\"\")","v":""},{"$f":"IF('Solar prot device - data'!E99<>\"\",'Solar prot device - data'!E99,\"\")","v":""},{"$f":"IF('Solar prot device - data'!F99<>\"\",'Solar prot device - data'!F99,\"\")","v":""},{"$f":"IF('Solar prot device - data'!G99<>\"\",'Solar prot device - data'!G99,\"\")","v":""},"","","","","","","","","","","","","","","",null,"","","","","","","","","","",null,"","","","","","","","","","",null,"","","","","","","","","","","","","","",""]
[null,{"$f":"'Solar prot device - data'!B100","v":86},{"$f":"IF('Solar prot device - data'!C100<>\"\",\"Glazing\"&\" + \"&'Solar prot device - data'!C100,\"\")","v":""},null,null,{"$f":"IF('Solar prot device - data'!D100<>\"\",'Solar prot device - data'!D100,\"\")","v":""},{"$f":"IF('Solar prot device - data'!E100<>\"\",'Solar prot device - data'!E100,\"\")","v":""},{"$f":"IF('Solar prot device - data'!F100<>\"\",'Solar prot device - data'!F100,\"\")","v":""},{"$f":"IF('Solar prot device - data'!G100<>\"\",'Solar prot device - data'!G100,\"\")","v":""},"","","","","","","","","","","","","","","",null,"","","","","","","","","","",null,"","","","","","","","","","",null,"","","","","","","","","","","","","","",""]
[null,{"$f":"'Solar prot device - data'!B101","v":87},{"$f":"IF('Solar prot device - data'!C101<>\"\",\"Glazing\"&\" + \"&'Solar prot device - data'!C101,\"\")","v":""},null,null,{"$f":"IF('Solar prot device - data'!D101<>\"\",'Solar prot device - data'!D101,\"\")","v":""},{"$f":"IF('Solar prot device - data'!E101<>\"\",'Solar prot device - data'!E101,\"\")","v":""},{"$f":"IF('Solar prot device - data'!F101<>\"\",'Solar prot device - data'!F101,\"\")","v":""},{"$f":"IF('Solar prot device - data'!G101<>\"\",'Solar prot device - data'!G101,\"\")","v":""},"","","","","","","","","","","","","","","",null,"","","","","","","","","","",null,"","","","","","","","","","",null,"","","","","","","","","","","","","","",""]
[null,{"$f":"'Solar prot device - data'!B102","v":88},{"$f":"IF('Solar prot device - data'!C102<>\"\",\"Glazing\"&\" + \"&'Solar prot device - data'!C102,\"\")","v":""},null,null,{"$f":"IF('Solar prot device - data'!D102<>\"\",'Solar prot device - data'!D102,\"\")","v":""},{"$f":"IF('Solar prot device - data'!E102<>\"\",'Solar prot device - data'!E102,\"\")","v":""},{"$f":"IF('Solar prot device - data'!F102<>\"\",'Solar prot device - data'!F102,\"\")","v":""},{"$f":"IF('Solar prot device - data'!G102<>\"\",'Solar prot device - data'!G102,\"\")","v":""},"","","","","","","","","","","","","","","",null,"","","","","","","","","","",null,"","","","","","","","","","",null,"","","","","","","","","","","","","","",""]
[null,{"$f":"'Solar prot device - data'!B103","v":89},{"$f":"IF('Solar prot device - data'!C103<>\"\",\"Glazing\"&\" + \"&'Solar prot device - data'!C103,\"\")","v":""},null,null,{"$f":"IF('Solar prot device - data'!D103<>\"\",'Solar prot device - data'!D103,\"\")","v":""},{"$f":"IF('Solar prot device - data'!E103<>\"\",'Solar prot device - data'!E103,\"\")","v":""},{"$f":"IF('Solar prot device - data'!F103<>\"\",'Solar prot device - data'!F103,\"\")","v":""},{"$f":"IF('Solar prot device - data'!G103<>\"\",'Solar prot device - data'!G103,\"\")","v":""},"","","","","","","","","","","","","","","",null,"","","","","","","","","","",null,"","","","","","","","","","",null,"","","","","","","","","","","","","","",""]
[null,{"$f":"'Solar prot device - data'!B104","v":90},{"$f":"IF('Solar prot device - data'!C104<>\"\",\"Glazing\"&\" + \"&'Solar prot device - data'!C104,\"\")","v":""},null,null,{"$f":"IF('Solar prot device - data'!D104<>\"\",'Solar prot device - data'!D104,\"\")","v":""},{"$f":"IF('Solar prot device - data'!E104<>\"\",'Solar prot device - data'!E104,\"\")","v":""},{"$f":"IF('Solar prot device - data'!F104<>\"\",'Solar prot device - data'!F104,\"\")","v":""},{"$f":"IF('Solar prot device - data'!G104<>\"\",'Solar prot device - data'!G104,\"\")","v":""},"","","","","","","","","","","","","","","",null,"","","","","","","","","","",null,"","","","","","","","","","",null,"","","","","","","","","","","","","","",""]
[null,{"$f":"'Solar prot device - data'!B105","v":91},{"$f":"IF('Solar prot device - data'!C105<>\"\",\"Glazing\"&\" + \"&'Solar prot device - data'!C105,\"\")","v":""},null,null,{"$f":"IF('Solar prot device - data'!D105<>\"\",'Solar prot device - data'!D105,\"\")","v":""},{"$f":"IF('Solar prot device - data'!E105<>\"\",'Solar prot device - data'!E105,\"\")","v":""},{"$f":"IF('Solar prot device - data'!F105<>\"\",'Solar prot device - data'!F105,\"\")","v":""},{"$f":"IF('Solar prot device - data'!G105<>\"\",'Solar prot device - data'!G105,\"\")","v":""},"","","","","","","","","","","","","","","",null,"","","","","","","","","","",null,"","","","","","","","","","",null,"","","","","","","","","","","","","","",""]
[null,{"$f":"'Solar prot device - data'!B106","v":92},{"$f":"IF('Solar prot device - data'!C106<>\"\",\"Glazing\"&\" + \"&'Solar prot device - data'!C106,\"\")","v":""},null,null,{"$f":"IF('Solar prot device - data'!D106<>\"\",'Solar prot device - data'!D106,\"\")","v":""},{"$f":"IF('Solar prot device - data'!E106<>\"\",'Solar prot device - data'!E106,\"\")","v":""},{"$f":"IF('Solar prot device - data'!F106<>\"\",'Solar prot device - data'!F106,\"\")","v":""},{"$f":"IF('Solar prot device - data'!G106<>\"\",'Solar prot device - data'!G106,\"\")","v":""},"","","","","","","","","","","","","","","",null,"","","","","","","","","","",null,"","","","","","","","","","",null,"","","","","","","","","","","","","","",""]
[null,{"$f":"'Solar prot device - data'!B107","v":93},{"$f":"IF('Solar prot device - data'!C107<>\"\",\"Glazing\"&\" + \"&'Solar prot device - data'!C107,\"\")","v":""},null,null,{"$f":"IF('Solar prot device - data'!D107<>\"\",'Solar prot device - data'!D107,\"\")","v":""},{"$f":"IF('Solar prot device - data'!E107<>\"\",'Solar prot device - data'!E107,\"\")","v":""},{"$f":"IF('Solar prot device - data'!F107<>\"\",'Solar prot device - data'!F107,\"\")","v":""},{"$f":"IF('Solar prot device - data'!G107<>\"\",'Solar prot device - data'!G107,\"\")","v":""},"","","","","","","","","","","","","","","",null,"","","","","","","","","","",null,"","","","","","","","","","",null,"","","","","","","","","","","","","","",""]
[null,{"$f":"'Solar prot device - data'!B108","v":94},{"$f":"IF('Solar prot device - data'!C108<>\"\",\"Glazing\"&\" + \"&'Solar prot device - data'!C108,\"\")","v":""},null,null,{"$f":"IF('Solar prot device - data'!D108<>\"\",'Solar prot device - data'!D108,\"\")","v":""},{"$f":"IF('Solar prot device - data'!E108<>\"\",'Solar prot device - data'!E108,\"\")","v":""},{"$f":"IF('Solar prot device - data'!F108<>\"\",'Solar prot device - data'!F108,\"\")","v":""},{"$f":"IF('Solar prot device - data'!G108<>\"\",'Solar prot device - data'!G108,\"\")","v":""},"","","","","","","","","","","","","","","",null,"","","","","","","","","","",null,"","","","","","","","","","",null,"","","","","","","","","","","","","","",""]
[null,{"$f":"'Solar prot device - data'!B109","v":95},{"$f":"IF('Solar prot device - data'!C109<>\"\",\"Glazing\"&\" + \"&'Solar prot device - data'!C109,\"\")","v":""},null,null,{"$f":"IF('Solar prot device - data'!D109<>\"\",'Solar prot device - data'!D109,\"\")","v":""},{"$f":"IF('Solar prot device - data'!E109<>\"\",'Solar prot device - data'!E109,\"\")","v":""},{"$f":"IF('Solar prot device - data'!F109<>\"\",'Solar prot device - data'!F109,\"\")","v":""},{"$f":"IF('Solar prot device - data'!G109<>\"\",'Solar prot device - data'!G109,\"\")","v":""},"","","","","","","","","","","","","","","",null,"","","","","","","","","","",null,"","","","","","","","","","",null,"","","","","","","","","","","","","","",""]
[null,{"$f":"'Solar prot device - data'!B110","v":96},{"$f":"IF('Solar prot device - data'!C110<>\"\",\"Glazing\"&\" + \"&'Solar prot device - data'!C110,\"\")","v":""},null,null,{"$f":"IF('Solar prot device - data'!D110<>\"\",'Solar prot device - data'!D110,\"\")","v":""},{"$f":"IF('Solar prot device - data'!E110<>\"\",'Solar prot device - data'!E110,\"\")","v":""},{"$f":"IF('Solar prot device - data'!F110<>\"\",'Solar prot device - data'!F110,\"\")","v":""},{"$f":"IF('Solar prot device - data'!G110<>\"\",'Solar prot device - data'!G110,\"\")","v":""},"","","","","","","","","","","","","","","",null,"","","","","","","","","","",null,"","","","","","","","","","",null,"","","","","","","","","","","","","","",""]
[null,{"$f":"'Solar prot device - data'!B111","v":97},{"$f":"IF('Solar prot device - data'!C111<>\"\",\"Glazing\"&\" + \"&'Solar prot device - data'!C111,\"\")","v":""},null,null,{"$f":"IF('Solar prot device - data'!D111<>\"\",'Solar prot device - data'!D111,\"\")","v":""},{"$f":"IF('Solar prot device - data'!E111<>\"\",'Solar prot device - data'!E111,\"\")","v":""},{"$f":"IF('Solar prot device - data'!F111<>\"\",'Solar prot device - data'!F111,\"\")","v":""},{"$f":"IF('Solar prot device - data'!G111<>\"\",'Solar prot device - data'!G111,\"\")","v":""},"","","","","","","","","","","","","","","",null,"","","","","","","","","","",null,"","","","","","","","","","",null,"","","","","","","","","","","","","","",""]
[null,{"$f":"'Solar prot device - data'!B112","v":98},{"$f":"IF('Solar prot device - data'!C112<>\"\",\"Glazing\"&\" + \"&'Solar prot device - data'!C112,\"\")","v":""},null,null,{"$f":"IF('Solar prot device - data'!D112<>\"\",'Solar prot device - data'!D112,\"\")","v":""},{"$f":"IF('Solar prot device - data'!E112<>\"\",'Solar prot device - data'!E112,\"\")","v":""},{"$f":"IF('Solar prot device - data'!F112<>\"\",'Solar prot device - data'!F112,\"\")","v":""},{"$f":"IF('Solar prot device - data'!G112<>\"\",'Solar prot device - data'!G112,\"\")","v":""},"","","","","","","","","","","","","","","",null,"","","","","","","","","","",null,"","","","","","","","","","",null,"","","","","","","","","","","","","","",""]
[null,{"$f":"'Solar prot device - data'!B113","v":99},{"$f":"IF('Solar prot device - data'!C113<>\"\",\"Glazing\"&\" + \"&'Solar prot device - data'!C113,\"\")","v":""},null,null,{"$f":"IF('Solar prot device - data'!D113<>\"\",'Solar prot device - data'!D113,\"\")","v":""},{"$f":"IF('Solar prot device - data'!E113<>\"\",'Solar prot device - data'!E113,\"\")","v":""},{"$f":"IF('Solar prot device - data'!F113<>\"\",'Solar prot device - data'!F113,\"\")","v":""},{"$f":"IF('Solar prot device - data'!G113<>\"\",'Solar prot device - data'!G113,\"\")","v":""},"","","","","","","","","","","","","","","",null,"","","","","","","","","","",null,"","","","","","","","","","",null,"","","","","","","","","","","","","","",""]
[null,{"$f":"'Solar prot device - data'!B114","v":100},{"$f":"IF('Solar prot device - data'!C114<>\"\",\"Glazing\"&\" + \"&'Solar prot device - data'!C114,\"\")","v":""},null,null,{"$f":"IF('Solar prot device - data'!D114<>\"\",'Solar prot device - data'!D114,\"\")","v":""},{"$f":"IF('Solar prot device - data'!E114<>\"\",'Solar prot device - data'!E114,\"\")","v":""},{"$f":"IF('Solar prot device - data'!F114<>\"\",'Solar prot device - data'!F114,\"\")","v":""},{"$f":"IF('Solar prot device - data'!G114<>\"\",'Solar prot device - data'!G114,\"\")","v":""},"","","","","","","","","","","","","","","",null,"","","","","","","","","","",null,"","","","","","","","","","",null,"","","","","","","","","","","","","","",""]

{"sheet":"Update","index":9,"n_rows":8,"n_cols":4,"rows_kept":8,"cut":false,"hidden":false,"merged":[]}
[]
[null,"Version #","Date","Main updates"]
[null,"Version 5","2007-12-12","correction cel E18 of the sheet 'Results-2'"]
[null,"Version 6","2008-05-15","Adaptations of the formulae in order to be conform with the new version of the standard EN13363-1 (2007)"]
[null,"Version 7","2008-07-24","The calculation of the 'shading factor' Fc has been added"]
[null,"Version 7.1","2021-10-22","Sends statistical data to BBRI"]
[null,"Version 7.2","2022-05-12","GDPR compliant popup"]
[null,"Version 8.1","2022-10-10","Update to be in line with last versions of standards + layout change"]

{"sheet":"GA_cookies","index":10,"n_rows":3,"n_cols":1,"rows_kept":3,"cut":false,"hidden":true,"merged":[]}
["Google Analytics ID"]
["Sum of openings"]
["Cookies accepted"]