{"text_format":"1","workbook":"xlsx","n_sheets":11,"sheets":["About","Intro","Definitions","Glazing","Solar prot device","Solar prot device - data","Results-1","Results-2","Results-3","Update","GA_cookies"],"not_rendered":{"charts":1,"images":6,"macros":1,"external_links":0,"defined_names":15,"comments":2,"pivot_tables":0},"unopened":[],"bounds":{"document_bytes":16777216,"sheet_cells":100000,"rows_first":2000,"rows_last":500,"rows_between":2000,"halvings":0,"cell_chars":16384,"cell_head_chars":4096},"cells_cut":0,"cells_raw":0,"read":"whole","date_system":"1900"}

{"sheet":"About","index":0,"n_rows":29,"n_cols":5,"rows_kept":29,"cut":false,"hidden":false,"merged":[[25,1,26,7]]}
[]
[]
[null,null,null,null,"EN 52022-1:2007"]
[]
[null,null,null,null,"Solar protection devices combined with glazing -"]
[null,null,null,null,"Calculation of solar and light transmittance -"]
[null,null,null,null,"Part 1: Simplified method"]
[]
[null,null,null,null,"Ontwikkeld door /  Développé par"]
[]
{"$rows_left_out":20}
{"sheet":"Intro","index":1,"n_rows":16,"n_cols":3,"rows_kept":16,"cut":false,"hidden":false,"merged":[]}
[]
[null,"EUROPEAN STANDARD EN ISO 52022-1:2017"]
[null,"Solar protection devices combined with glazing - Calculation of solar and light transmittance - Part 1 : Simplified method"]
[null,"The standard EN ISO 52022-1 gives a simplified method based on the usually known data of the glazing, the U- and g-value, and the solar transmittance and reflectance of the solar protection device to estimate the total solar energy transmittance of a solar protection device combined with a glazing."]
[null,"\nThe results of this simplified method are approximate and generally tend to lie on the safe side for cooling load estimations."]
[null,"\nThe text of the standard EN ISO 52022-1 must be consulted to know the exact application of this method. When the simplified method is not applicable, the detailled method described in EN ISO 52022-3 must be applied. "]
[null,"\nThis Excel sheet allows to carry out the calculations given in this standard in order to be able to estimate the total solar energy transmittance (g-value), the direct solar transmittance, the secondary internal heat transfer factor and the light transmittance of a solar protection device combined with glazing."]
[null,"\nIt contains the following sheets:"]
[null,"· Some definitions are given in the sheet \"Definitions\".","Definitions"]
[null,"· Typical data for glazing are indicated in the sheet \"Glazing\".","Glazing"]
{"$rows_left_out":7}
{"sheet":"Definitions","index":2,"n_rows":52,"n_cols":3,"rows_kept":52,"cut":false,"hidden":false,"merged":[[10,1,10,2],[35,1,35,2],[46,1,46,2]]}
[]
[null,"Definitions"]
[null,"τe ","The direct solar transmittance is the fraction of the incident solar radiation that is directly transmitted by the component (component can be : glazing, solar protection device, combination solar protection device-glazing, …)"]
[null,"ρe","The direct solar reflectance is the fraction of the incident solar radiation that is directly reflected by the component."]
[null,"g","The total solar energy transmittance (solar factor) is the sum of the direct solar transmittance te and the indirect solar transmittance (fraction of the absorbed radiation that is reemitted to inside).This is the fraction of the total transmitted energy to the total incident solar radiation."]
[null,"U","The thermal transmittance is the density of heat flow rate through a component in the steady state divided by the temperature difference between the surroundings on each side of the component (in W/m² K)"]
[null,"Fc ","The Shading factor is the ratio of the solar factor of the combined glazing and solar protection device gtot to that of the glazing alone g "]
[]
[null,"Characteristic data"]
[null,"Glazing"]
{"$rows_left_out":43}
{"sheet":"Glazing","index":3,"n_rows":14,"n_cols":11,"rows_kept":14,"cut":false,"hidden":false,"merged":[[13,1,13,10]]}
[]
[null,"Data for typical glazing"]
[null,"As defined in Annex A of EN 14501:2021"]
[]
[null,"Reference","Product","Ug\nW/(m².K)","g","τe","ρe","ρ'e","τv","ρv","ρ'v"]
[null,"Glazing A","Clear single glazing (4 mm)",5.8,0.85,0.83,0.08,0.08,0.9,0.08,0.08]
[null,"Glazing B","Clear double glazing (4-12-4)",2.9,0.76,0.69,0.14000000000000001,0.14000000000000001,0.82,0.15,0.15]
[null,"Glazing C","Double glazing (4-16-4)",1.2,0.59,0.49,0.28999999999999998,0.27,0.8,0.15,0.1]
[null,"Glazing D","Solar control glazing (4-16-4)",1.1000000000000001,0.32,0.27,0.28999999999999998,0.38,0.44,0.43,0.38]
[null,"Glazing E","Triple glazing (4-14-4-14-4)",0.8,0.55000000000000004,0.5,0.22,0.23,0.73,0.16,0.16]
{"$rows_left_out":5}
{"sheet":"Solar prot device","index":4,"n_rows":14,"n_cols":7,"rows_kept":14,"cut":false,"hidden":false,"merged":[[4,1,4,6],[15,1,15,6],[14,1,14,6],[6,3,6,6],[6,2,7,2]]}
[]
[null,"Typical data for solar protection devices"]
[null,"As defined in Annex E of ISO/TR 52022-2:2017"]
[]
[null,"The next table gives typical values of transmittance and reflectance of solar protection device materials. These are indicative values given for information."]
[]
[null,null,"τe,B","ρe,B"]
[null,null,null,"White","Pastel","Dark","Black"]
[null,"Opaque (e.g. closed roller shutter)",0,0.7,0.5,0.3,0.1]
[null,"Closed venetian blind with opque slats",0.1,0.7,0.5,0.3,0.1]
{"$rows_left_out":5}
{"sheet":"Solar prot device - data","index":5,"n_rows":114,"n_cols":10,"rows_kept":114,"cut":false,"hidden":false,"merged":[[8,2,8,8],[6,2,6,8],[7,2,7,8]]}
[]
[null,"Data for solar protection device"]
[]
[null,"Please enter the characteristic data of your solar protection devices in the following table :"]
[null,"Where:"]
[null,"τe,B *","(Direct) Solar transmittance of the solar protection device [-]",null,null,null,null,null,null,"* Required for the calculation of the g-value"]
[null,"ρe,B * ","Solar reflectance of the side of the solar protection device facing the incident radiation [-]",null,null,null,null,null,null,"* Required for the calculation of the g-value"]
[null,"ρ'e,B ","Solar reflectance of the side of the solar protection device opposite from the incident radiation [-]"]
[null,"αe,B","Solar absorptance of the side of the solar protection device facing the incident radiation [-]"]
[null,"τv,B ","Light transmittance of the solar protection device [-]"]
{"$rows_left_out":105}
{"sheet":"Results-1","index":6,"n_rows":114,"n_cols":28,"rows_kept":114,"cut":false,"hidden":false,"merged":[[7,1,7,18],[12,10,12,12],[12,20,12,22],[12,13,12,14],[12,15,12,16],[12,17,12,18]]}
[]
[null,"Please enter the characteristic data of the glazing with which you want to combine the solar protection device :",null,null,null,null,null,null,null,null,null,null,null,null,null,null,null,null,null,null,null,null,null,null,null,null,"G1",5]
[null,"* Required for the calculation of the g-value",null,null,null,null,null,null,null,null,null,null,null,null,null,null,null,null,null,null,null,null,null,null,null,null,"G2 ext",10]
[null,null,null,null,null,null,null,null,null,null,null,null,null,null,null,null,null,null,null,null,null,null,null,null,null,null,"G2 int",30]
[null,null,"Name of the glazing","Ug * ","g * ","τe ","ρe ","ρ'e ","τv ","ρv ","ρ'v ",null,null,null,null,null,null,null,null,null,null,null,null,null,null,null,"G3",3]
[null,null,"Your glazing",1.2,0.59,0.49,0.23,0.28999999999999998,0.8,0.15,0.1,null,null,null,null,null,null,null,null,null,null,null,null,null,null,null,"G ext",{"$f":"1/(1/$D$6+1/$AB$2+1/$AB$3)","v":0.88235294117647045}]
[null,null,null,null,null,null,null,null,null,null,null,null,null,null,null,null,null,null,null,null,null,null,null,null,null,null,"G int",{"$f":"1/(1/$D$6+1/$AB$4)","v":1.1538461538461537}]
[null,"The following table gives the total solar energy transmittance gtot, the direct solar transmittance τe,tot, the secondary internal heat transfer factor qi,tot and the light transmittance τv,tot for the combination of the specified glazing (see characteristics above) and solar protection devices (see characteristics in sheet \"Solar prot. device-data\") according to the standard EN ISO 52022-1. Three cases are distinguished : external solar protection device, internal solar protection device and integrated solar protection device (between glass panes). The calculations are done for the 3 cases, independently of the intended use of the protection device.",null,null,null,null,null,null,null,null,null,null,null,null,null,null,null,null,null,null,null,null,null,null,null,null,"G between",{"$f":"1/(1/$D$6+1/$AB$5)","v":0.8571428571428571}]
[]
[]
{"$rows_left_out":105}
{"sheet":"Results-2","index":7,"n_rows":54,"n_cols":32,"rows_kept":54,"cut":false,"hidden":false,"merged":[[3,6,4,8],[2,1,2,9],[1,1,1,11]]}
[]
[null,"The following chart gives the total solar energy transmittance gtotal for the combination glazing - solar protection device. The solar protection device can be external, internal or integrated between the panes. The effect of different U-values and g-values of the glazing on the total solar energy transmittance of the combination is shown. Please, note that the calculation are done for combination of Ug you specify, and all g-values between 0.18 and 0.85, independently of the fact that such glazing exist or not."]
[null,"Choose the solar protection device that you want to analyse :"]
[null,null,null,null,null,null,"(See sheet \"Solar prot device - data\")",null,null,null,null,null,null,null,null,null,null,null,"Glazing","U1",{"$f":"D14","v":2.9},"(U=thermal transmittance in [W/(m²K)])"]
[null,"10",null,null,null,null,null,null,null,null,null,null,null,null,null,null,null,null,null,"U2",{"$f":"D15","v":1.1000000000000001}]
[null,null,null,null,null,null,null,null,null,null,null,null,null,null,null,null,null,null,null,"U3",{"$f":"D16","v":0.8}]
[null,"Blind","Name:",{"$f":"VLOOKUP($U$7,'Solar prot device - data'!$B$15:$E$114,2)","v":"High translucent - Pastel"},null,null,null,null,null,null,null,null,null,null,null,null,null,null,"Blind","n°",{"$f":"B5*1","v":10},null,null,"G1",5,"W/m²K"]
[null,null,"τe,B *",{"$f":"IF(VLOOKUP($U$7,'Solar prot device - data'!$B$15:$G$114,3)<>\"\",VLOOKUP($U$7,'Solar prot device - data'!$B$15:$G$114,3),\"\")","v":0.4},null,null,null,null,null,null,null,null,null,null,null,null,null,null,null,"Name",{"$f":"VLOOKUP($U$7,'Solar prot device - data'!$B$15:$E$114,2)","v":"High translucent - Pastel"},null,null,"G2 ext",10,"W/m²K"]
[null,null,"ρe,B * ",{"$f":"IF(VLOOKUP($U$7,'Solar prot device - data'!$B$15:$G$114,4)<>\"\",VLOOKUP($U$7,'Solar prot device - data'!$B$15:$G$114,4),\"\")","v":0.3},null,null,null,null,null,null,null,null,null,null,null,null,null,null,null,"te,B",{"$f":"D8","v":0.4},null,null,"G2 int",30,"W/m²K"]
[null,null,"αe,B",{"$f":"IF(VLOOKUP($U$7,'Solar prot device - data'!$B$15:$G$114,6)<>\"\",VLOOKUP($U$7,'Solar prot device - data'!$B$15:$G$114,6),\"\")","v":0.3},null,null,null,null,null,null,null,null,null,null,null,null,null,null,null,"re,B",{"$f":"D9","v":0.3},null,null,"G3",3,"W/m²K"]
{"$rows_left_out":45}
{"sheet":"Results-3","index":8,"n_rows":114,"n_cols":69,"rows_kept":114,"cut":false,"hidden":false,"merged":[[11,47,11,61],[12,9,12,13],[12,14,12,18],[12,19,12,23],[12,25,12,29],[12,30,12,34],[12,57,12,61],[12,52,12,56],[12,47,12,51],[12,36,12,40],[12,41,12,45],[10,1,10,13],[1,1,1,23],[11,9,11,23],[11,25,11,34],[11,36,11,45]]}
[]
[null,"Calculation of the total solar energy transmittance (gtot), the direct solar transmittance τe,tot and the secondary internal heat transfer factor qi,tot for the combination of the reference glazing indicated in the standard EN 14501:2021 and the specified solar protection devices (see characteristics in sheet \"Solar prot. device-data\").",null,null,null,null,null,null,null,null,null,null,null,null,null,null,null,null,null,null,null,null,null,null,null,null,null,null,null,null,null,null,null,null,null,null,null,null,null,null,null,null,null,null,null,null,null,null,null,null,null,null,null,null,null,null,null,null,null,null,null,null,null,null,"Glazing A","Glazing B","Glazing C","Glazing A","Glazing B"]
[null,null,null,null,null,null,null,null,null,null,null,null,null,null,null,null,null,null,null,null,null,null,null,null,null,null,null,null,null,null,null,null,null,null,null,null,null,null,null,null,null,null,null,null,null,null,null,null,null,null,null,null,null,null,null,null,null,null,null,null,null,null,null,"U",{"$f":"$D5","v":5.8},{"$f":"$D6","v":2.9},{"$f":"$D7","v":1.2},{"$f":"$D8","v":1.1000000000000001},{"$f":"$D9","v":0.8}]
[null,null,null,"Ug","g","τe,B","ρe,B","ρ'e,B ",null,null,null,null,null,null,null,null,null,null,null,null,null,null,null,null,null,null,null,null,null,null,null,null,null,null,null,null,null,null,null,null,null,null,null,null,null,null,null,null,null,null,null,null,null,null,null,null,null,null,null,null,null,null,null,"g",{"$f":"$E5","v":0.85},{"$f":"$E6","v":0.76},{"$f":"$E7","v":0.59},{"$f":"$E8","v":0.32},{"$f":"$E9","v":0.55000000000000004}]
[null,null,"Glazing A",5.8,0.85,0.83,0.08,0.08,null,null,null,null,null,null,null,null,null,null,null,null,null,null,null,null,null,null,null,null,null,null,null,null,null,null,null,null,null,null,null,null,null,null,null,null,null,null,null,null,null,null,null,null,null,null,null,null,null,null,null,null,null,null,null,"G1",5,5,5,5,5]
[null,null,"Glazing B",2.9,0.76,0.69,0.14000000000000001,0.14000000000000001,null,null,null,null,null,null,null,null,null,null,null,null,null,null,null,null,null,null,null,null,null,null,null,null,null,null,null,null,null,null,null,null,null,null,null,null,null,null,null,null,null,null,null,null,null,null,null,null,null,null,null,null,null,null,null,"G2 ext",10,10,10,10,10]
[null,null,"Glazing C",1.2,0.59,0.49,0.28999999999999998,0.27,null,null,null,null,null,null,null,null,null,null,null,null,null,null,null,null,null,null,null,null,null,null,null,null,null,null,null,null,null,null,null,null,null,null,null,null,null,null,null,null,null,null,null,null,null,null,null,null,null,null,null,null,null,null,null,"G2 int",30,30,30,30,30]
[null,null,"Glazing D",1.1000000000000001,0.32,0.27,0.28999999999999998,0.38,null,null,null,null,null,null,null,null,null,null,null,null,null,null,null,null,null,null,null,null,null,null,null,null,null,null,null,null,null,null,null,null,null,null,null,null,null,null,null,null,null,null,null,null,null,null,null,null,null,null,null,null,null,null,null,"G3",3,3,3,3,3]
[null,null,"Glazing E",0.8,0.55000000000000004,0.5,0.22,0.23,null,null,null,null,null,null,null,null,null,null,null,null,null,null,null,null,null,null,null,null,null,null,null,null,null,null,null,null,null,null,null,null,null,null,null,null,null,null,null,null,null,null,null,null,null,null,null,null,null,null,null,null,null,null,null,"G ext",{"$f":"1/(1/BM$3+1/BM$5+1/BM$6)","v":2.1167883211678831},{"$f":"1/(1/BN$3+1/BN$5+1/BN$6)","v":1.5508021390374334},{"$f":"1/(1/BO$3+1/BO$5+1/BO$6)","v":0.88235294117647045},{"$f":"1/(1/BP$3+1/BP$5+1/BP$6)","v":0.82706766917293228},{"$f":"1/(1/BQ$3+1/BQ$5+1/BQ$6)","v":0.64516129032258063}]
[null,null,null,null,null,null,null,null,null,null,null,null,null,null,null,null,null,null,null,null,null,null,null,null,null,null,null,null,null,null,null,null,null,null,null,null,null,null,null,null,null,null,null,null,null,null,null,null,null,null,null,null,null,null,null,null,null,null,null,null,null,null,null,"G int",{"$f":"1/(1/BM$3+1/BM$7)","v":4.8603351955307259},{"$f":"1/(1/BN$3+1/BN$7)","v":2.6443768996960486},{"$f":"1/(1/BO$3+1/BO$7)","v":1.1538461538461537},{"$f":"1/(1/BP$3+1/BP$7)","v":1.0610932475884245},{"$f":"1/(1/BQ$3+1/BQ$7)","v":0.77922077922077915}]
{"$rows_left_out":105}
{"sheet":"Update","index":9,"n_rows":8,"n_cols":4,"rows_kept":8,"cut":false,"hidden":false,"merged":[]}
[]
[null,"Version #","Date","Main updates"]
[null,"Version 5","2007-12-12","correction cel E18 of the sheet 'Results-2'"]
[null,"Version 6","2008-05-15","Adaptations of the formulae in order to be conform with the new version of the standard EN13363-1 (2007)"]
[null,"Version 7","2008-07-24","The calculation of the 'shading factor' Fc has been added"]
[null,"Version 7.1","2021-10-22","Sends statistical data to BBRI"]
[null,"Version 7.2","2022-05-12","GDPR compliant popup"]
[null,"Version 8.1","2022-10-10","Update to be in line with last versions of standards + layout change"]

{"sheet":"GA_cookies","index":10,"n_rows":3,"n_cols":1,"rows_kept":3,"cut":false,"hidden":true,"merged":[]}
["Google Analytics ID"]
["Sum of openings"]
["Cookies accepted"]