{"text_format":"1","workbook":"xlsx","n_sheets":7,"sheets":["Info","Coef d'expansion","Calcul - Berekening","Directives","Richtlijnen","Langage","GA_cookies"],"not_rendered":{"charts":10,"images":4,"macros":1,"external_links":0,"defined_names":15,"comments":2,"pivot_tables":0},"unopened":[],"bounds":{"document_bytes":16777216,"sheet_cells":100000,"rows_first":2000,"rows_last":500,"rows_between":2000,"halvings":0,"cell_chars":16384,"cell_head_chars":4096},"cells_cut":0,"cells_raw":0,"read":"whole","date_system":"1900"}

{"sheet":"Info","index":0,"n_rows":31,"n_cols":5,"rows_kept":31,"cut":false,"hidden":false,"merged":[[4,1,4,7],[25,1,25,7],[9,1,9,7],[27,1,27,7],[28,1,28,7],[11,1,11,7],[12,1,12,7],[13,1,13,7]]}
[]
[]
[]
[]
[null,"Dimensionering van diafragma-expansievaten"]
[null,null,null,null,"NBN EN 12828:2013 - Bijlage D"]
[]
[null,null,null,null,"Ontwikkeld in het kader van het Belgische project \"KMO - normenantenne\""]
[]
[null,"Bezoek onze website : www.buildwise.be"]
[]
[null,"Buildwise kan niet verantwoordelijk gesteld worden voor de ingevoerde  "]
[null,"gegevens, noch voor het verkeerde gebruik van de software"]
[null,"of de verkeerde resultaten die eruit zouden voortkomen."]
[]
[]
[]
[]
[]
[]
[null,null,null,null,"Dimensionnement des vases d'expansion à diaphragme"]
[null,null,null,null,"NBN EN 12828:2013 - Annexe D"]
[]
[null,null,null,null,"Développé dans le cadre du projet belge \"PME - antenne normes\""]
[]
[null,"Visitez notre site web : www.buildwise.be"]
[]
[null,"Buildwise ne peut être tenu responsable des données introduites, de la"]
[null,"mauvaise utilisation du programme ou des erreurs qui en résulteraient."]
[]
{"$rows_left_out":2}
{"sheet":"Coef d'expansion","index":1,"n_rows":53,"n_cols":10,"rows_kept":53,"cut":false,"hidden":true,"merged":[[2,1,2,6],[18,0,18,6],[26,1,26,6]]}
[]
[]
["Température maximale de service","Coefficient d'expansion e (en %) pour différentes\nconcentrations de produit antigel (ethylène glycol) (en %)\n",null,null,null,null,null,"Volume massique\neau pure\n","Pression de vapeur saturante\neau pure","Débit de contraction"]
["°C",0,10,20,30,40,50,"dm³/kg","bar","l.h/kW"]
[10,0,0,0,0,0,0,1.0003,0]
[20,0.14000000000000001,0.28999999999999998,0.31,0.34,0.36,0.38,1.0017,0]
[30,0.4,0.63,0.67,0.72,0.77,0.81,1.0043,0]
[40,0.75,1.02,1.0900000000000001,1.1599999999999999,1.22,1.3,1.0078,0]
[50,1.18,1.46,1.55,1.64,1.74,1.83,1.0121,0,0.39]
[60,1.68,1.96,2.0699999999999998,2.1800000000000002,2.2999999999999998,2.42,1.0170999999999999,0,0.45]
[70,2.25,2.5099999999999998,2.64,2.78,2.91,3.06,1.0227999999999999,0,0.51]
[80,2.89,3.12,3.27,3.43,3.59,3.76,1.0291999999999999,0,0.56999999999999995]
[90,3.57,3.79,3.96,4.1399999999999997,4.32,4.51,1.0361,0,0.63]
[100,4.34,4.5199999999999996,4.71,4.91,5.1100000000000003,5.33,1.0437000000000001,0.01,0.69]
[110,5.15,5.31,5.52,5.74,5.97,6.21,1.0519000000000001,0.43]
[120,6.02,6.17,6.4,6.64,6.89,7.16,1.0606,0.99]
[130,6.97,7.04,7.28,7.55,7.83,8.1199999999999992,1.07,1.7]
[]
["Références:\nRecknagel - Genie Climatique 2007 - Tableau 1.3.1-6\nAshrae Handbook - Fundamentals (SI) 2009 - Tableau 6 page 31.7"]
["* Valeurs extrapolées"]
[]
[]
[]
[]
[]
[]
["Température maximale de service","Coefficient d'expansion e (en %) pour différentes\nconcentrations de produit antigel (ethylène glycol) (en %)\n",null,null,null,null,null,"Volume massique\neau pure\n","Pression de vapeur saturante\neau pure"]
["°C",0,10,20,30,40,50,"dm³/kg","bar"]
[10,0,0,0,0,0,0,1.0003,0]
[15,{"$f":"0.00034*A30^2+0.01099*A30-0.2014","v":3.9950000000000013E-2},{"$f":"0.00028*A30^2+0.01915*A30-0.20713","v":0.14312},{"$f":"0.0003*A30^2+0.0216*A30-0.2336","v":0.15790000000000001},{"$f":"0.00028*A30^2+0.02383*A30-0.25217","v":0.16827999999999999},{"$f":"0.00028*A30^2+0.02603*A30-0.27336","v":0.18009000000000003},{"$f":"0.00028*A30^2+0.0285*A30-0.30098","v":0.18951999999999997},null,0]
{"$rows_left_out":24}
{"sheet":"Calcul - Berekening","index":2,"n_rows":112,"n_cols":31,"rows_kept":112,"cut":false,"hidden":false,"merged":[[8,1,8,2],[8,3,8,9],[3,1,3,10],[5,1,5,10],[7,1,7,2],[7,3,7,6],[7,8,7,9],[19,1,19,6],[9,1,9,2],[9,3,9,9],[10,1,10,2],[10,3,10,9],[11,1,11,2],[11,3,11,9],[13,1,13,10],[15,1,15,6],[16,1,16,6],[17,1,17,6],[18,1,18,6],[35,1,35,3],[20,1,20,6],[21,1,21,6],[22,1,22,6],[23,1,23,6],[25,1,25,10],[27,1,27,3],[28,1,28,3],[29,1,29,3],[30,1,30,3],[32,1,32,10],[34,1,34,3],[43,1,43,3],[46,1,46,10],[51,1,51,10],[36,1,36,3],[37,1,37,3],[38,1,38,3],[39,1,39,3],[40,1,40,3],[41,1,41,3],[42,1,42,3]]}
[]
[null,null,null,"Français",null,null,null,{"$f":"Langage!A13","v":"Nouveau calcul"}]
[]
[null,{"$f":"Langage!A5","v":"Tableau de calcul du vase d'expansion fermé à pression variable - NBN EN 12828:2013"}]
[]
[null,{"$f":"Langage!A6","v":"Références"}]
[]
[null,{"$f":"Langage!A15","v":"Dossier"},null,null,null,null,null,{"$f":"Langage!A20","v":"    Date"}]
[null,{"$f":"Langage!A16","v":"Nom"}]
[null,{"$f":"Langage!A17","v":"Adresse"}]
[null,{"$f":"Langage!A18","v":"Commune"}]
[null,{"$f":"Langage!A19","v":"Commentaire"}]
[]
[null,{"$f":"Langage!A7","v":"Données relatives à l'installation"},null,null,null,null,null,null,null,null,null,null,"Valeurs de calcul"]
[]
[null,{"$f":"Langage!A22","v":"1 Température maximale de service"},null,null,null,null,null,"qmax",null,"°C",null,null,{"$f":"IF(I16=\"\",\"\",I16)","v":""},null,null,null,null,null,null,null,null,null,null,10,2.5,null,{"$f":"IF(X16=\"\",\"\",VLOOKUP(X16, 'Coef d''expansion'!A$29:G$53, MATCH(M$17, 'Coef d''expansion'!A$28:G$28, 0), FALSE))","v":{"$error":"#N/A"}},{"$f":"IF(OR(M$36=\"\",M$39=\"\",I$43=\"\",M$20=\"\",AA16=\"\"),\"\",(M$36+1)*M$39/(M$39-I$43-M$20*(AA16/100))-1)","v":{"$error":"#N/A"}},{"$f":"IF(OR(AB16=\"\",X16>I$16),\"\",AB16)","v":{"$error":"#N/A"}},{"$f":"0","v":0},"Range"]
[null,{"$f":"Langage!A23","v":"2 Concentration en antigel (éthylène glycol)"},null,null,null,null,null,null,null,"%",null,null,{"$f":"IF(I17=\"\",\"\",I17)","v":""},null,null,null,null,null,null,null,null,null,null,15,3,null,{"$f":"IF(X17=\"\",\"\",VLOOKUP(X17, 'Coef d''expansion'!A$29:G$53, MATCH(M$17, 'Coef d''expansion'!A$28:G$28, 0), FALSE))","v":{"$error":"#N/A"}},{"$error":"#N/A"},{"$f":"IF(OR(AB17=\"\",X17>I$16),\"\",AB17)","v":{"$error":"#N/A"}},{"$f":"IF(T$37=\"\",\"\",IF(T$37<0.05,\"\",5))","v":""},"=$X$16:INDEX($X$16:$X$40;COUNT($AC$16:$AC$40))"]
[null,{"$f":"Langage!A24","v":"3 Coefficient d'expansion (remplissage à 10°C)"},null,null,null,null,null,"e",{"$f":"IF(OR(M16=\"\",M17=\"\"),\"\",VLOOKUP(M16, 'Coef d''expansion'!A29:G53, MATCH(M17, 'Coef d''expansion'!A28:G28, 0), FALSE))","v":""},"%",null,null,null,null,null,null,null,null,null,null,null,null,null,20,3.5,null,{"$f":"IF(X18=\"\",\"\",VLOOKUP(X18, 'Coef d''expansion'!A$29:G$53, MATCH(M$17, 'Coef d''expansion'!A$28:G$28, 0), FALSE))","v":{"$error":"#N/A"}},{"$error":"#N/A"},{"$error":"#N/A"},{"$f":"IF(T$37=\"\",\"\",IF(T$37<0.1,\"\",10))","v":""},"=$AC$16:INDEX($AC$16:$AC$40;COUNT($AC$16:$AC$40))"]
[null,{"$f":"Langage!A25","v":"4 Pression de vapeur saturante"},null,null,null,null,null,"pv",{"$f":"IF(M16=\"\",\"\",VLOOKUP(M16, 'Coef d''expansion'!A29:I53, 9, FALSE))","v":""},"bar",null,null,null,null,null,null,null,null,null,null,null,null,null,25,4,null,{"$f":"IF(X19=\"\",\"\",VLOOKUP(X19, 'Coef d''expansion'!A$29:G$53, MATCH(M$17, 'Coef d''expansion'!A$28:G$28, 0), FALSE))","v":{"$error":"#N/A"}},{"$error":"#N/A"},{"$error":"#N/A"},{"$f":"IF(T$37=\"\",\"\",IF(T$37<0.15,\"\",15))","v":""}]
[null,{"$f":"Langage!A26","v":"5 Contenance en eau de l'installation"},null,null,null,null,null,"Vsystem",null,"l",null,null,{"$f":"IF(I20=\"\",\"\",ROUND(I20,0))","v":""},null,null,null,null,null,null,null,null,null,null,30,4.5,null,{"$f":"IF(X20=\"\",\"\",VLOOKUP(X20, 'Coef d''expansion'!A$29:G$53, MATCH(M$17, 'Coef d''expansion'!A$28:G$28, 0), FALSE))","v":{"$error":"#N/A"}},{"$error":"#N/A"},{"$error":"#N/A"},{"$f":"IF(T$37=\"\",\"\",IF(T$37<0.2,\"\",20))","v":""}]
[null,{"$f":"Langage!A27","v":"6 Hauteur statique"},null,null,null,null,null,"hst",null,"m",null,null,{"$f":"IF(I21=\"\",\"\",ROUND(I21,1))","v":""},null,null,null,null,null,null,null,null,null,null,35,5,null,{"$f":"IF(X21=\"\",\"\",VLOOKUP(X21, 'Coef d''expansion'!A$29:G$53, MATCH(M$17, 'Coef d''expansion'!A$28:G$28, 0), FALSE))","v":{"$error":"#N/A"}},{"$error":"#N/A"},{"$error":"#N/A"},{"$f":"IF(T$37=\"\",\"\",IF(T$37<0.25,\"\",25))","v":""}]
[null,{"$f":"Langage!A28","v":"7 Différence de hauteur entre le vase et la soupape de sécurité"},null,null,null,null,null,"hXW",null,"m",null,null,{"$f":"IF(I22=\"\",\"\",ROUND(I22,1))","v":""},null,null,null,null,null,null,null,null,null,null,40,6,null,{"$f":"IF(X22=\"\",\"\",VLOOKUP(X22, 'Coef d''expansion'!A$29:G$53, MATCH(M$17, 'Coef d''expansion'!A$28:G$28, 0), FALSE))","v":{"$error":"#N/A"}},{"$error":"#N/A"},{"$error":"#N/A"},{"$f":"IF(T$37=\"\",\"\",IF(T$37<0.3,\"\",30))","v":""}]
[null,{"$f":"Langage!A29","v":"8 Pression de refoulement de la pompe"},null,null,null,null,null,"Dpp",null,"bar",null,null,"",null,null,null,null,null,null,null,null,null,null,45,7,null,{"$f":"IF(X23=\"\",\"\",VLOOKUP(X23, 'Coef d''expansion'!A$29:G$53, MATCH(M$17, 'Coef d''expansion'!A$28:G$28, 0), FALSE))","v":{"$error":"#N/A"}},{"$error":"#N/A"},{"$error":"#N/A"},{"$f":"IF(T$37=\"\",\"\",IF(T$37<0.35,\"\",35))","v":""}]
[null,{"$f":"Langage!A30","v":"9 Pression de tarage de la soupape de sécurité"},null,null,null,null,null,"psv",null,"bar",null,null,"",null,null,null,null,null,null,null,null,null,null,50,8,null,{"$f":"IF(X24=\"\",\"\",VLOOKUP(X24, 'Coef d''expansion'!A$29:G$53, MATCH(M$17, 'Coef d''expansion'!A$28:G$28, 0), FALSE))","v":{"$error":"#N/A"}},{"$error":"#N/A"},{"$error":"#N/A"},{"$f":"IF(T$37=\"\",\"\",IF(T$37<0.4,\"\",40))","v":""}]
[null,null,null,null,null,null,null,null,null,null,null,null,null,null,null,null,null,null,null,null,null,null,null,55,null,null,{"$f":"IF(X25=\"\",\"\",VLOOKUP(X25, 'Coef d''expansion'!A$29:G$53, MATCH(M$17, 'Coef d''expansion'!A$28:G$28, 0), FALSE))","v":{"$error":"#N/A"}},{"$error":"#N/A"},{"$error":"#N/A"},{"$f":"IF(T$37=\"\",\"\",IF(T$37<0.45,\"\",45))","v":""}]
[null,{"$f":"Langage!A8","v":"Calculs intermédiaires"},null,null,null,null,null,null,null,null,null,null,{"$f":"IF(OR(M24=\"\",M22=\"\"),\"\",ROUND(M24+(M22*0.0981),1))","v":""},null,"Pression au vase correspondant à la pression d'ouverture de la soupape ",null,null,null,null,null,null,null,null,60,null,null,{"$f":"IF(X26=\"\",\"\",VLOOKUP(X26, 'Coef d''expansion'!A$29:G$53, MATCH(M$17, 'Coef d''expansion'!A$28:G$28, 0), FALSE))","v":{"$error":"#N/A"}},{"$error":"#N/A"},{"$error":"#N/A"},{"$f":"IF(T$37=\"\",\"\",IF(T$37<0.5,\"\",50))","v":""}]
[null,null,null,null,null,null,null,null,null,null,null,null,null,null,null,null,null,null,null,null,null,null,null,65,null,null,{"$f":"IF(X27=\"\",\"\",VLOOKUP(X27, 'Coef d''expansion'!A$29:G$53, MATCH(M$17, 'Coef d''expansion'!A$28:G$28, 0), FALSE))","v":{"$error":"#N/A"}},{"$error":"#N/A"},{"$error":"#N/A"},{"$f":"IF(T$37=\"\",\"\",IF(T$37<0.6,\"\",60))","v":""}]
[null,{"$f":"Langage!A31","v":"10 Volume d'expansion de l'eau"},null,null,null,null,null,"Vex",{"$f":"IF(OR(I18=\"\",M20=\"\"),\"\",I18*M20/100)","v":""},"l",null,null,null,null,null,null,null,null,null,null,null,null,null,70,null,null,{"$f":"IF(X28=\"\",\"\",VLOOKUP(X28, 'Coef d''expansion'!A$29:G$53, MATCH(M$17, 'Coef d''expansion'!A$28:G$28, 0), FALSE))","v":{"$error":"#N/A"}},{"$error":"#N/A"},{"$error":"#N/A"},{"$f":"IF(T$37=\"\",\"\",IF(T$37<0.7,\"\",70))","v":""}]
[null,{"$f":"Langage!A32","v":"11 Volume de réserve d'eau minimal"},null,null,null,null,null,"Vwr,min",{"$f":"IF(I28=\"\",\"\",IF(AND(I39<>\"\",I39<15), I39*0.2, MAX(M20*0.005,3)))","v":""},"l",null,null,null,null,null,null,null,null,null,null,null,null,null,75,null,null,{"$f":"IF(X29=\"\",\"\",VLOOKUP(X29, 'Coef d''expansion'!A$29:G$53, MATCH(M$17, 'Coef d''expansion'!A$28:G$28, 0), FALSE))","v":{"$error":"#N/A"}},{"$error":"#N/A"},{"$error":"#N/A"},{"$f":"IF(T$37=\"\",\"\",IF(T$37<0.8,\"\",80))","v":""}]
[null,{"$f":"Langage!A33","v":"12 Pression maximale admissible"},null,null,null,null,null,"pfin,max",{"$f":"IF(OR(M22=\"\",M23=\"\",M24=\"\"),\"\",M24+(M22*0.0981)-M23-MAX(0.5,0.1*M24))","v":""},"bar",null,null,null,null,null,null,null,null,null,null,null,null,null,80,null,null,{"$f":"IF(X30=\"\",\"\",VLOOKUP(X30, 'Coef d''expansion'!A$29:G$53, MATCH(M$17, 'Coef d''expansion'!A$28:G$28, 0), FALSE))","v":{"$error":"#N/A"}},{"$error":"#N/A"},{"$error":"#N/A"},{"$f":"IF(T$37=\"\",\"\",IF(T$37<0.9,\"\",90))","v":""}]
{"$rows_left_out":83}
{"sheet":"Directives","index":3,"n_rows":102,"n_cols":3,"rows_kept":102,"cut":false,"hidden":false,"merged":[[78,1,78,2],[82,1,82,2],[84,1,84,2],[86,1,86,2],[59,1,59,2],[61,1,61,2],[66,1,66,2],[72,1,72,2],[76,1,76,2],[38,1,38,2],[40,1,40,2],[53,1,53,2],[55,1,55,2],[57,1,57,2],[92,1,92,2],[1,1,1,2],[34,1,34,2],[28,1,28,2],[3,1,3,2],[4,1,4,2],[5,1,5,2],[6,1,6,2],[9,1,9,2],[10,1,10,2],[21,1,21,2],[46,1,46,2],[22,1,22,2],[24,1,24,2],[31,1,31,2],[32,1,32,2],[30,1,30,2],[99,1,99,2],[80,1,80,2],[88,1,88,2],[90,1,90,2],[95,1,95,2],[97,1,97,2],[48,1,48,2],[50,1,50,2],[64,1,64,2],[68,1,68,2],[70,1,70,2],[74,1,74,2],[36,1,36,2],[42,1,42,2],[44,1,44,2]]}
[]
[null,"DIRECTIVES POUR L'UTILISATION DE LA FEUILLE DE CALCUL"]
[]
[null,"Affichage des directives à côté du tableau de calcul"]
[]
[null,"Dans le menu Affichage (View), cliquez sur Nouvelle fenêtre (New Window)"]
[null,"Vous obtenez deux fenêtres de cette feuille Excel:"]
[null,"1.","Une première dans laquelle vous pouvez afficher le tableau de calcul"]
[null,"2.","Une seconde dans laquelle vous pouvez afficher les directives"]
[null,"Dans le menu Affichage (View), cliquez sur Réorganiser tout (Arrange All)"]
[null,"Dans les options, sélectionnez Mosaïque (Tiled)"]
[]
[]
[]
[]
[]
[]
[]
[]
[]
[]
[]
[null,"Remplissage de la feuille de calcul"]
[]
[null,"Le remplissage de la feuille de calcul se déroule en 3 étapes :"]
[null,"1.","Introduction des références administratives"]
[null,"2.","Introduction des données générales de l'installation"]
[null,"3.","Choix du vase d'expansion et de la pression initiale"]
[null,"Dans la feuille de calcul, seuls les champs en couleur doivent être complétés par l'utilisateur, tous les autres sont protégés et sont automatiquement calculés et complétés."]
[]
{"$rows_left_out":73}
{"sheet":"Richtlijnen","index":4,"n_rows":102,"n_cols":3,"rows_kept":102,"cut":false,"hidden":false,"merged":[[86,1,86,2],[38,1,38,2],[40,1,40,2],[53,1,53,2],[55,1,55,2],[57,1,57,2],[42,1,42,2],[74,1,74,2],[80,1,80,2],[92,1,92,2],[95,1,95,2],[97,1,97,2],[99,1,99,2],[9,1,9,2],[44,1,44,2],[10,1,10,2],[21,1,21,2],[22,1,22,2],[24,1,24,2],[28,1,28,2],[30,1,30,2],[31,1,31,2],[32,1,32,2],[34,1,34,2],[36,1,36,2],[1,1,1,2],[3,1,3,2],[4,1,4,2],[5,1,5,2],[6,1,6,2],[88,1,88,2],[90,1,90,2],[46,1,46,2],[48,1,48,2],[50,1,50,2],[64,1,64,2],[68,1,68,2],[70,1,70,2],[59,1,59,2],[61,1,61,2],[66,1,66,2],[72,1,72,2],[76,1,76,2],[78,1,78,2],[82,1,82,2],[84,1,84,2]]}
[]
[null,"RICHTLIJNEN VOOR HET GEBRUIK VAN HET REKENBLAD"]
[]
[null,"Weergave van de richtlijnen naast de berekeningstabel"]
[]
[null,"In de menutab Beeld (View), klik op Nieuw venster (New Window)"]
[null,"U krijgt twee vensters van dit Excel-blad:"]
[null,"1.","Een eerste waarin u de berekeningstabel kunt weergeven"]
[null,"2.","Een tweede waarin u de richtlijnen kunt weergeven"]
[null,"In de menutab Beeld (View), klik op Alle vensters (Arrange All)"]
[null,"In de opties, kies Naast elkaar (Tiled)"]
[]
[]
[]
[]
[]
[]
[]
[]
[]
[]
[]
[null," Invullen van het rekenblad"]
[]
[null,"Het invullen van het rekenblad verloopt in 3 stappen:"]
[null,"1.","Invoering van de administratieve gegevens"]
[null,"2.","Invoering van de algemene gegevens van de installatie"]
[null,"3.","Keuze van het expansievat en berekening van de begindruk"]
[null,"In het Excel-document dienen enkel de omkaderde velden door de gebruiker ingevuld te worden. Alle andere velden zijn beschermd en worden automatisch berekend en ingevuld."]
[]
{"$rows_left_out":73}
{"sheet":"Langage","index":5,"n_rows":60,"n_cols":3,"rows_kept":60,"cut":false,"hidden":true,"merged":[]}
["Choix"]
[null,1,2]
[{"$f":"'Calcul - Berekening'!D2","v":"Français"},"Français","Nederlands"]
[{"$f":"IF(A$3=B$3,B4,C4)","v":"fr_be"},"fr_be","nl_be"]
[{"$f":"IF(A$3=B$3,B5,C5)","v":"Tableau de calcul du vase d'expansion fermé à pression variable - NBN EN 12828:2013"},"Tableau de calcul du vase d'expansion fermé à pression variable - NBN EN 12828:2013","Rekenblad gesloten expansievat met variabele druk - NBN EN 12828:2013"]
[{"$f":"IF(A$3=B$3,B6,C6)","v":"Références"},"Références","Referentie"]
["Données relatives à l'installation","Données relatives à l'installation","Invoergegevens voor de installatie"]
["Calculs intermédiaires","Calculs intermédiaires","Tussenberekening"]
["Choix du vase d'expansion","Choix du vase d'expansion","Keuze van het expansievat"]
[{"$f":"IF(A$3=B$3,B10,C10)","v":"Pression de remplissage"},"Pression de remplissage","Vuldruk"]
[{"$f":"IF(A$3=B$3,B11,C11)","v":"Perte de pression de gonflage"},"Perte de pression de gonflage","Voordrukverlies"]
[]
["Nouveau calcul","Nouveau calcul","Nieuwe berekening"]
[]
[{"$f":"IF(A$3=B$3,B15,C15)","v":"Dossier"},"Dossier","Dossier"]
["Nom","Nom","Naam"]
["Adresse","Adresse","Adres"]
["Commune","Commune","Gemeente"]
["Commentaire","Commentaire","Commentaar"]
["    Date","    Date","    Datum"]
[]
["1 Température maximale de service","1 Température maximale de service","1 Maximale bedrijfstemperatuur"]
["2 Concentration en antigel (éthylène glycol)","2 Concentration en antigel (éthylène glycol)","2 Concentratie aan antivriesproduct (ethyleenglycol)"]
["3 Coefficient d'expansion (remplissage à 10°C)","3 Coefficient d'expansion (remplissage à 10°C)","3 Expansiecoëfficiënt (vulling op 10°C)"]
["4 Pression de vapeur saturante","4 Pression de vapeur saturante","4 Relatieve dampdruk"]
["5 Contenance en eau de l'installation","5 Contenance en eau de l'installation","5 Waterinhoud van de installatie"]
["6 Hauteur statique","6 Hauteur statique","6 Statische hoogte"]
["7 Différence de hauteur entre le vase et la soupape de sécurité","7 Différence de hauteur entre le vase et la soupape de sécurité","7 Hoogteverschil tussen het expansievat en het veiligheidsventiel"]
["8 Pression de refoulement de la pompe","8 Pression de refoulement de la pompe","8 Opvoerdruk van de pomp"]
["9 Pression de tarage de la soupape de sécurité","9 Pression de tarage de la soupape de sécurité","9 Insteldruk van het veiligheidsventiel"]
{"$rows_left_out":31}
{"sheet":"GA_cookies","index":6,"n_rows":3,"n_cols":1,"rows_kept":3,"cut":false,"hidden":true,"merged":[]}
["Google Analytics ID"]
["Sum of openings"]
["Cookies accepted"]